{"text_format":"1","workbook":"xlsx","n_sheets":8,"sheets":["Instructions","Feasibility Guide - Mod. Cash","Feasibility Guide - Accrual","Primary Fees","Secondary Fees","Feasibility","Cashflow","Comments"],"not_rendered":{"charts":0,"images":0,"macros":1,"external_links":0,"defined_names":6,"comments":0,"pivot_tables":0},"unopened":[],"bounds":{"document_bytes":16777216,"sheet_cells":100000,"rows_first":2000,"rows_last":500,"rows_between":2000,"halvings":0,"cell_chars":16384,"cell_head_chars":4096},"cells_cut":0,"cells_raw":0,"read":"whole","date_system":"1900"}

{"sheet":"Instructions","index":0,"n_rows":28,"n_cols":3,"rows_kept":28,"cut":false,"hidden":false,"merged":[[1,0,1,2],[21,0,21,2],[24,0,24,2],[27,0,27,2],[9,2,10,2]]}
[]
["2024 CDF CASHFLOW INSTRUCTIONS"]
[]
["Please use the yellow dropdown boxes to indicate the:"]
[]
["School type:","Primary"]
[]
["Accounting method used:"]
[]
["Fee structure:",null,{"$f":"IF(Fee_Structure=\"Tiered or per child\",\"Please Note: There is a fee calculation tab available for the\nTiered or per child fee structure\",\"\")","v":""}]
[]
["This template consists of six worksheets which appear depending on your selections above"]
[]
["1. Instructions"]
[]
["2. Guide to completing the Feasibility Worksheet - Modified Cash or Accural"]
[]
["3. Primary Fees or Secondary Fees"]
["This worksheet is required if your fee structure is \"Tiered or per child\". The values entered flow into the Cashflow worksheet"]
[]
["4. Feasibility"]
["This worksheet is the input sheet where data is to be entered.  Data is to be obtained from past and current audited Annual Financial Statements (audited AFS actual figures for the three previous years + AFS budget figures) along with budget figures for the two subsequent years.\n\nThe table on the following worksheet provides an outline of where the amounts for each of the items can be obtained from within the Annual Financial Statement."]
[]
["5. Cashflow"]
["This worksheet is a summary of the past, current and budgeted financial position of the school.\n\nIf any discrepancies are detected e.g. the budget figures show a percentage change that is outside the expected range, then the relevant area will be highlighted as per the legend located on the bottom left of the 'Cashflow' worksheet.  In this case, a comment should be provided to explain the discrepancy by clicking on the 'Add Comment' button located on the bottom right of the 'Cashflow' worksheet."]
[]
["6. Comments"]
["This worksheet lists all comments that have been added to explain any discrepancies on the 'Cashflow' worksheet.  This worksheet can also be used to add any additional, explanatory comments."]

{"sheet":"Feasibility Guide - Mod. Cash","index":1,"n_rows":69,"n_cols":5,"rows_kept":69,"cut":false,"hidden":true,"merged":[[3,1,4,2],[1,1,1,4]]}
[]
[null,"GUIDE TO COMPLETING THE FEASIBILITY WORKSHEET - MODIFIED CASH"]
[]
[null,null,null,"ACTUAL/BUDGET","Subtotal"]
[null,null,null,"YEAR 20XX ($)","Ref in AFS"]
[null,"Number of students",null,"From AFS Notes to Page 1"]
[null,"Number of families",null,"From AFS Notes to Page 1"]
[]
[null,"Annual fees"]
[null,"Tuition ",null,"Per family fee from AFS Notes to Page 1. If tiered or per child structure, perform the appropriate calculation by using the Fees tab."]
[null,"Capital  ",null,"Per family fee from AFS Notes to Page 1. If tiered or per child structure, perform the appropriate calculation by using the Fees tab."]
[null,"Total fees",null,"This is a calculated field (Tuition fee + Capital fee)."]
[]
[null,"Total collection rate",null,"This is a calculated field (Total fees collected / Total fees)."]
[]
[null,"Recurrent Income"]
[null,"Fees received",null,"Sum of  AFS accounts  0110"]
[null,"Government grants",null,"Sum of AFS accounts 0600, 0610 to 0624, 0627, 0650, 0651, 0660 to 0667, 0671 and 0675"]
[null,"Parish contribution and school building fund- recurrent",null,"Sum of AFS accounts 0540 and 0710"]
[null,"\nOther recurrent income (ORI)",null,"Sum of the remainder of the AFS recurrent income accounts\n0420, 0120, 0115, 0310, 0122, 0425, 0435, 0450, 0510, 0520, 0541, 0550, 0715, 0720, 0910 & 0915 & \n8075, 0445, 0460, 0465, 0470, 0480 & 8095 "]
[null,"Total Recurrent Income",null,"This is a calculated field (Sum of recurrent income)","A1"]
[null,"Recurrent Expenditure"]
[null,"Salaries",null,"Sum of AFS accounts 1030 to 1035,  1040 to 1048, 1950,1960, 1970 1990, 1910 & 1850"]
[null,"Interest expense",null,"Sum of AFS Accounts 2910, 2920 and 2940."]
[null,"Other recurrent expenditure (ORC)",null,"Sum of remainder of the AFS accounts   1980 to 2972 and 2810 (RE.080)\n& 2012, 2014,2015,2025, 2035, 2045, 2050, 2061, 2070 (RE.090)  \n& 2060, 2063 (RE.095) & 2990 (RE.085)\n& 2601, 2602, 9510, 1050, 1051, 1052, 2486 to 2489, 2500 and 8096."]
[null,"Total Recurrent Expenditure",null,"This is a calculated field (Sum of recurrent expenditure)","A3"]
[null,"Recurrent surplus/deficit",null,"This is a calculated field (Total Recur. Income - Total Recur. Expenditure)","A7"]
[null,"Capital Income"]
[null,"Capital grant",null,"Sum of AFS accounts 0680 to 0693"]
[null,"Fees",null,"Equal or portion of AFS account 0925"]
{"$rows_left_out":40}
{"sheet":"Feasibility Guide - Accrual","index":2,"n_rows":85,"n_cols":5,"rows_kept":85,"cut":false,"hidden":false,"merged":[[1,1,1,4],[3,1,4,2],[62,3,68,3]]}
[]
[null,"GUIDE TO COMPLETING THE FEASIBILITY WORKSHEET - ACCRUAL"]
[]
[null,"School Location and Name",null,"ACTUAL/BUDGET","Subtotal"]
[null,null,null,"YEAR 20XX ($)","Ref in AFS"]
[null,"Number of students",null,"From  AFS Notes to Page 1"]
[null,"Number of families",null,"From  AFS Notes to Page 1"]
[]
[null,"Annual fees "]
[null,"Tuition ",null,"Per family fee from  AFS Notes to Page 1. If tiered or per child structure, perform the appropriate calculation by using the Fees tab."]
[null,"Capital  ",null,"Per family fee from AFS Notes to Page 1. If tiered or per child structure, perform the appropriate calculation by using the Fees tab."]
[null,"Total fees",null,"This is a calculated field (Tuition fee + Capital fee)."]
[]
[null,"Total collection rate",null,"This is a calculated field (Total fees collected / Total fees)."]
[]
[null,"Recurrent Income"]
[null,"Fees received",null,"Sum of  AFS accounts  0110"]
[null,"Government grants",null,"Sum of AFS accounts 0600, 0610 to 0624, 0627, 0650, 0660 to 0667, 0671 and 0675"]
[null,"Parish contribution and school building fund- recurrent",null,"Sum of AFS accounts 0540 and 0710"]
[null,"\nOther recurrent income (ORI)",null,"Sum of the remainder of the AFS recurrent income accounts\n0420, 0120, 0115, 0310, 0122, 0425, 0435, 0450, 0510, 0520, 0541, 0550, 0715, 0720, 0910 & 0915 \n8075, 0445, 0460, 0465, 0470, 0480 & 8095 "]
[null,"Total Recurrent Income",null,"This is a calculated field (Sum of recurrent income)","A1"]
[null,"Recurrent Expenditure"]
[null,"Salaries",null,"Sum of AFS accounts 1030 to 1035,  1040 to 1048, 1950,1960, 1970 1990, 1910 & 1850"]
[null,"Interest expense",null,"Sum of AFS Accounts 2910, 2920 and 2940."]
[null,"Other recurrent expenditure (ORC)",null,"Sum of remainder of the AFS accounts   1980 to 2972 and 2810 (RE.080)\n& 2012, 2014,2015,2025, 2035, 2045, 2050, 2061, 2062, 2070 (RE.090)  \n& 2060, 2063 (RE.095) & 2990 (RE.085) & 2720, 2730 (RE.130) and 2840 (RE.140)\n& 2601, 2602, 9510, 1050, 1051, 1052, 2486 to 2489, 2500 and 8096."]
[null,"Total Recurrent Expenditure",null,"This is a calculated field (Sum of recurrent expenditure)","A3"]
[null,"Less:  Depreciation / Band & Doubtful Debt Expense",null,"Equal to AFS account 2720, 2730 (RE.130) and 2840 (RE.140)"]
[null,"Recurrent surplus/deficit",null,"This is a calculated field (Total Recur. Income - Total Recur. Expenditure + Depreciation)","A7"]
[]
[null,"Capital Income"]
{"$rows_left_out":56}
{"sheet":"Primary Fees","index":3,"n_rows":184,"n_cols":8,"rows_kept":184,"cut":false,"hidden":true,"merged":[]}
[]
[null,{"$f":"Feasibility!D3","v":2023},"School Fee Information"]
[null,"Fees & Charges","Number of Families","Recurrent","Capital","Total Recurrent Charged","Total Capital Charged","Total Amount Charged"]
[null,"Family Fee",null,0,0,{"$f":"C4*D4","v":0},{"$f":"C4*E4","v":0},{"$f":"SUM(F4:G4)","v":0}]
[null,"Total (A)",{"$f":"C4","v":0},null,null,{"$f":"SUM(F4)","v":0},{"$f":"SUM(G4)","v":0},{"$f":"SUM(H4)","v":0}]
[null,"1. Tier Fee",null,0,0,{"$f":"C6*D6","v":0},{"$f":"C6*E6","v":0},{"$f":"SUM(F6:G6)","v":0}]
[null,"2. Tier Fee",null,0,0,{"$f":"C7*D7","v":0},{"$f":"C7*E7","v":0},{"$f":"SUM(F7:G7)","v":0}]
[null,"Total (B)",{"$f":"SUM(C6:C7)","v":0},null,null,{"$f":"SUM(F6:F7)","v":0},{"$f":"SUM(G6:G7)","v":0},{"$f":"SUM(H6:H7)","v":0}]
[null,"1 Child Fee",null,0,0,{"$f":"C9*D9","v":0},{"$f":"C9*E9","v":0},{"$f":"SUM(F9:G9)","v":0}]
[null,"2 Children Fee",null,0,0,{"$f":"C10*D10","v":0},{"$f":"C10*E10","v":0},{"$f":"SUM(F10:G10)","v":0}]
[null,"3 Children Fee",null,0,0,{"$f":"C11*D11","v":0},{"$f":"C11*E11","v":0},{"$f":"SUM(F11:G11)","v":0}]
[null,"4 Children Fee",null,0,0,{"$f":"C12*D12","v":0},{"$f":"C12*E12","v":0},{"$f":"SUM(F12:G12)","v":0}]
[null,"Total (C )",{"$f":"SUM(C9:C12)","v":0},null,null,{"$f":"SUM(F9:F12)","v":0},{"$f":"SUM(G9:G12)","v":0},{"$f":"SUM(H9:H12)","v":0}]
[null,null,"Enrolments"]
[null,"Prep",null,0,0,{"$f":"C15*D15","v":0},{"$f":"C15*E15","v":0},{"$f":"SUM(F15:G15)","v":0}]
[null,"Year 1",null,0,0,0,0,0]
[null,"Year 2",null,0,0,0,0,0]
[null,"Year 3",null,0,0,0,0,0]
[null,"Year 4",null,0,0,{"$f":"C19*D19","v":0},{"$f":"C19*E19","v":0},{"$f":"SUM(F19:G19)","v":0}]
[null,"Year 5",null,0,0,0,0,0]
[null,"Year 6",null,0,0,0,0,0]
[null,"Total (D)",{"$f":"SUM(C15:C21)","v":0},null,null,{"$f":"SUM(F15:F21)","v":0},{"$f":"SUM(G15:G21)","v":0},{"$f":"SUM(H15:H21)","v":0}]
[null,"Grand Total",null,null,null,{"$f":"F5+F8+F13+F22","v":0},{"$f":"G5+G8+G13+G22","v":0},{"$f":"H5+H8+H13+H22","v":0}]
[]
[null,{"$f":"Feasibility!E3","v":2024},"School Fee Information"]
[null,"Fees & Charges","Number of Families","Recurrent","Capital","Total Recurrent Charged","Total Capital Charged","Total Amount Charged"]
[null,"Family Fee",null,0,0,{"$f":"C27*D27","v":0},{"$f":"C27*E27","v":0},{"$f":"SUM(F27:G27)","v":0}]
[null,"Total (A)",{"$f":"C27","v":0},null,null,{"$f":"SUM(F27)","v":0},{"$f":"SUM(G27)","v":0},{"$f":"SUM(H27)","v":0}]
[null,"1. Tier Fee",null,0,0,{"$f":"C29*D29","v":0},{"$f":"C29*E29","v":0},{"$f":"SUM(F29:G29)","v":0}]
[null,"2. Tier Fee",null,0,0,{"$f":"C30*D30","v":0},{"$f":"C30*E30","v":0},{"$f":"SUM(F30:G30)","v":0}]
{"$rows_left_out":155}
{"sheet":"Secondary Fees","index":4,"n_rows":176,"n_cols":8,"rows_kept":176,"cut":false,"hidden":true,"merged":[]}
[]
[null,{"$f":"Feasibility!D3","v":2023},"School Fee Information"]
[null,"Fees & Charges","Number of Families","Recurrent","Capital","Total Recurrent Charged","Total Capital Charged","Total Amount Charged"]
[null,"Family Fee",null,0,0,{"$f":"C4*D4","v":0},{"$f":"C4*E4","v":0},{"$f":"SUM(F4:G4)","v":0}]
[null,"Total (A)",{"$f":"C4","v":0},null,null,{"$f":"SUM(F4)","v":0},{"$f":"SUM(G4)","v":0},{"$f":"SUM(H4)","v":0}]
[null,"1. Tier Fee",null,0,0,{"$f":"C6*D6","v":0},{"$f":"C6*E6","v":0},{"$f":"SUM(F6:G6)","v":0}]
[null,"2. Tier Fee",null,0,0,{"$f":"C7*D7","v":0},{"$f":"C7*E7","v":0},{"$f":"SUM(F7:G7)","v":0}]
[null,"Total (B)",{"$f":"SUM(C6:C7)","v":0},null,null,{"$f":"SUM(F6:F7)","v":0},{"$f":"SUM(G6:G7)","v":0},{"$f":"SUM(H6:H7)","v":0}]
[null,"1 Child Fee",null,0,0,{"$f":"C9*D9","v":0},{"$f":"C9*E9","v":0},{"$f":"SUM(F9:G9)","v":0}]
[null,"2 Children Fee",null,0,0,{"$f":"C10*D10","v":0},{"$f":"C10*E10","v":0},{"$f":"SUM(F10:G10)","v":0}]
[null,"3 Children Fee",null,0,0,{"$f":"C11*D11","v":0},{"$f":"C11*E11","v":0},{"$f":"SUM(F11:G11)","v":0}]
[null,"4 Children Fee",null,0,0,{"$f":"C12*D12","v":0},{"$f":"C12*E12","v":0},{"$f":"SUM(F12:G12)","v":0}]
[null,"Total (C )",{"$f":"SUM(C9:C12)","v":0},null,null,{"$f":"SUM(F9:F12)","v":0},{"$f":"SUM(G9:G12)","v":0},{"$f":"SUM(H9:H12)","v":0}]
[null,null,"Enrolments"]
[null,"Year 7",null,0,0,{"$f":"C15*D15","v":0},{"$f":"C15*E15","v":0},{"$f":"SUM(F15:G15)","v":0}]
[null,"Year 8",null,0,0,0,0,0]
[null,"Year 9",null,0,0,0,0,0]
[null,"Year 10",null,0,0,0,0,0]
[null,"Year 11",null,0,0,0,0,0]
[null,"Year 12",null,0,0,0,0,0]
[null,"Total (D)",{"$f":"SUM(C15:C20)","v":0},null,null,{"$f":"SUM(F15:F20)","v":0},{"$f":"SUM(G15:G20)","v":0},{"$f":"SUM(H15:H20)","v":0}]
[null,"Grand Total",null,null,null,{"$f":"F5+F8+F13+F21","v":0},{"$f":"G5+G8+G13+G21","v":0},{"$f":"H5+H8+H13+H21","v":0}]
[]
[null,{"$f":"B2+1","v":2024},"School Fee Information"]
[null,"Fees & Charges","Number of Families","Recurrent","Capital","Total Recurrent Charged","Total Capital Charged","Total Amount Charged"]
[null,"Family Fee",null,0,0,{"$f":"C26*D26","v":0},{"$f":"C26*E26","v":0},{"$f":"SUM(F26:G26)","v":0}]
[null,"Total (A)",{"$f":"C26","v":0},null,null,{"$f":"SUM(F26)","v":0},{"$f":"SUM(G26)","v":0},{"$f":"SUM(H26)","v":0}]
[null,"1. Tier Fee",null,0,0,{"$f":"C28*D28","v":0},{"$f":"C28*E28","v":0},{"$f":"SUM(F28:G28)","v":0}]
[null,"2. Tier Fee",null,0,0,{"$f":"C29*D29","v":0},{"$f":"C29*E29","v":0},{"$f":"SUM(F29:G29)","v":0}]
[null,"Total (B)",{"$f":"SUM(C28:C29)","v":0},null,null,{"$f":"SUM(F28:F29)","v":0},{"$f":"SUM(G28:G29)","v":0},{"$f":"SUM(H28:H29)","v":0}]
{"$rows_left_out":147}
{"sheet":"Feasibility","index":5,"n_rows":90,"n_cols":13,"rows_kept":90,"cut":false,"hidden":true,"merged":[[1,1,2,2],[90,3,92,9]]}
[null,{"$f":"Accounting_Method","v":0},null,null,null,null,null,null,null,null,null,"Modified Cash","Primary"]
[null,"School name - school location",null,"ACTUAL","ACTUAL","ACTUAL","BUDGET","BUDGET","BUDGET","BUDGET","BUDGET"]
[null,null,null,2023,{"$f":"D3+1","v":2024},{"$f":"E3+1","v":2025},2026,2027,2028,2029,2030]
[null,"Number of students",null," "]
[null,"Number of families"]
[]
[null,"ANNUAL FEES"]
[null,"Tuition",null,{"$f":"'Primary Fees'!F23","v":0},{"$f":"'Primary Fees'!F46","v":0},{"$f":"'Primary Fees'!F69","v":0},{"$f":"'Primary Fees'!F92","v":0},{"$f":"'Primary Fees'!F115","v":0},{"$f":"'Primary Fees'!F138","v":0},{"$f":"'Primary Fees'!F161","v":0},{"$f":"'Primary Fees'!F184","v":0}]
[null,"Capital",null,{"$f":"'Primary Fees'!G23","v":0},{"$f":"'Primary Fees'!G46","v":0},{"$f":"'Primary Fees'!G69","v":0},{"$f":"'Primary Fees'!G92","v":0},{"$f":"'Primary Fees'!G115","v":0},{"$f":"'Primary Fees'!G138","v":0},{"$f":"'Primary Fees'!G161","v":0},{"$f":"'Primary Fees'!G184","v":0}]
[null,"Total fees",null,{"$f":"SUM(D8:D9)","v":0},0,0,0,0,0,0,{"$f":"SUM(K8:K9)","v":0}]
[]
[null,"Total collection rate",null,{"$f":"IF(ISERROR(IF(Fee_Structure=\"Per family\", (D15+D32+D33)/(D10*D5), (D15+D32+D33)/D10)),\"\",\nIF(Fee_Structure=\"Per family\", (D15+D32+D33)/(D10*D5), (D15+D32+D33)/D10))","v":""},{"$f":"IF(ISERROR(IF(Fee_Structure=\"Per family\", (E15+E32+E33)/(E10*E5), (E15+E32+E33)/E10)),\"\",\nIF(Fee_Structure=\"Per family\", (E15+E32+E33)/(E10*E5), (E15+E32+E33)/E10))","v":""},"","","","","",""]
[]
[null,"RECURRENT INCOME"]
[null,"Fees received"]
[null,"Government grants"]
[null,"Parish contribution and school building fund - recurrent"]
[null,"Other recurrent income (ORI)"]
[null,"Total recurrent income",null,{"$f":"SUM(D15:D18)","v":0},0,0,0,0,0,0,{"$f":"SUM(K15:K18)","v":0}]
[]
[null,"RECURRENT EXPENDITURE"]
[null,"Salaries"]
[null,"Interest expense"]
[null,"Other recurrent expenditure (ORC)"]
[null,"Total recurrent expenditure",null,{"$f":"SUM(D22:D24)","v":0},0,0,0,0,0,0,{"$f":"SUM(K22:K24)","v":0}]
[null,"Less Depreciation/Bad & Doubtful Debt (Accrual only)"]
[]
[null,"Recurrent surplus/deficit (Excl Depreciation if Applicable)",null,{"$f":"D19-D25+D26","v":0},{"$f":"E19-E25+E26","v":0},0,0,0,0,0,0]
[]
[null,"CAPITAL INCOME"]
{"$rows_left_out":61}
{"sheet":"Cashflow","index":6,"n_rows":81,"n_cols":19,"rows_kept":81,"cut":false,"hidden":true,"merged":[[7,0,8,1],[2,3,2,10],[3,3,3,10],[4,3,4,10],[5,3,5,10]]}
[]
[]
[null,"Accounting Method Used",null,"Meeting target  (Income Above Expected Increase.                Expenditure Below Expected Increase)"]
[null,{"$f":"Instructions!E4","v":0},null,"Near target       (Income 0% - 5% Below Expected Increase.   Expenditure 0% - 5% Above Expected Increase)"]
[null,"School Type",null,"Not near target (Income 5% Below Expected Increase.           Expenditure 5% Above Expected Increase)"]
[null,{"$f":"Instructions!F4","v":0},null,"Capital Fees make up more than 25% of total recurrent fees collected"]
[]
[{"$f":"Feasibility!B2","v":"School name - school location"},null,"Actual","Actual","Actual","Budget","Change ","Budget","Change","Budget","Change","Budget","Change","Budget","Change","EXPECTED"]
[null,null,{"$f":"Feasibility!D3","v":2023},{"$f":"Feasibility!E3","v":2024},{"$f":"Feasibility!F3","v":2025},{"$f":"Feasibility!G3","v":2026},{"$f":"Feasibility!G3","v":2026},{"$f":"Feasibility!H3","v":2027},{"$f":"Feasibility!H3","v":2027},{"$f":"Feasibility!I3","v":2028},{"$f":"Feasibility!I3","v":2028},{"$f":"Feasibility!J3","v":2029},{"$f":"Feasibility!J3","v":2029},{"$f":"Feasibility!K3","v":2030},{"$f":"Feasibility!K3","v":2030},"INCREASE (%)"]
[]
["Enrolments",null,{"$f":"Feasibility!D4","v":" "},{"$f":"Feasibility!E4","v":0},{"$f":"Feasibility!F4","v":0},{"$f":"Feasibility!G4","v":0},null,{"$f":"Feasibility!H4","v":0},null,{"$f":"Feasibility!I4","v":0},null,{"$f":"Feasibility!J4","v":0},null,{"$f":"Feasibility!K4","v":0}]
["Total collection rate",null,{"$f":"IF(ISERR(Feasibility!D12), 0, Feasibility!D12)","v":""},{"$f":"IF(ISERR(Feasibility!E12), 0, Feasibility!E12)","v":""},{"$f":"IF(ISERR(Feasibility!F12), 0, Feasibility!F12)","v":""},{"$f":"IF(ISERR(Feasibility!G12), 0, Feasibility!G12)","v":""},null,{"$f":"IF(ISERR(Feasibility!H12), 0, Feasibility!H12)","v":""},null,{"$f":"IF(ISERR(Feasibility!I12), 0, Feasibility!I12)","v":""},null,{"$f":"IF(ISERR(Feasibility!J12), 0, Feasibility!J12)","v":""},null,{"$f":"IF(ISERR(Feasibility!K12), 0, Feasibility!K12)","v":""},null,0.82499999999999996,0.9,1,1.05]
["20 % of fees collected equals",null,{"$f":"(C17+C36)*0.2","v":0},{"$f":"(D17+D36)*0.2","v":0},{"$f":"(E17+E36)*0.2","v":0},{"$f":"(F17+F36)*0.2","v":0},null,{"$f":"(H17+H36)*0.2","v":0},null,{"$f":"(J17+J36)*0.2","v":0},null,{"$f":"(L17+L36)*0.2","v":0},null,{"$f":"(N17+N36)*0.2","v":0}]
["Loan repayment as a % of (fees collected and",null,{"$f":"IF((C17+C36) = 0, 0, (C47-C41-C40-C42-C37)/(C17+C36))","v":0},{"$f":"IF((D17+D36) = 0, 0, (D47-D41-D40-D42-D37)/(D17+D36))","v":0},{"$f":"IF((E17+E36) = 0, 0, (E47-E41-E40-E42-E37)/(E17+E36))","v":0},{"$f":"IF((F17+F36) = 0, 0, (F47-F41-F40-F42-F37)/(F17+F36))","v":0},null,{"$f":"IF((H17+H36) = 0, 0, (H47-H41-H40-H42-H37)/(H17+H36))","v":0},null,{"$f":"IF((J17+J36) = 0, 0, (J47-J41-J40-J42-J37)/(J17+J36))","v":0},null,{"$f":"IF((L17+L36) = 0, 0, (L47-L41-L40-L42-L37)/(L17+L36))","v":0},null,{"$f":"IF((N17+N36) = 0, 0, (N47-N41-N40-N42-N37)/(N17+N36))","v":0},null,0.08,0.1,0.2,0.3]
["supplementary capital fund and building funds)"]
["TOTAL RECURRENT INCOME",null,null,null,null," "]
[null,"Fees received",{"$f":"Feasibility!D15","v":0},{"$f":"Feasibility!E15","v":0},{"$f":"Feasibility!F15","v":0},{"$f":"Feasibility!G15","v":0},{"$f":"ROUND(IF(ISERR((F17-E17)/E17), 0, (F17-E17)/E17),4)","v":0},{"$f":"Feasibility!H15","v":0},{"$f":"IF(ISERR((H17-F17)/F17), 0, (H17-F17)/F17)","v":0},{"$f":"Feasibility!I15","v":0},{"$f":"IF(ISERR((J17-H17)/H17), 0, (J17-H17)/H17)","v":0},{"$f":"Feasibility!J15","v":0},{"$f":"IF(ISERR((L17-J17)/J17), 0, (L17-J17)/J17)","v":0},{"$f":"Feasibility!K15","v":0},{"$f":"IF(ISERR((N17-L17)/L17), 0, (N17-L17)/L17)","v":0},0.03]
[null,{"$f":"Feasibility!B16","v":"Government grants"},{"$f":"Feasibility!D16","v":0},{"$f":"Feasibility!E16","v":0},{"$f":"Feasibility!F16","v":0},{"$f":"Feasibility!G16","v":0},{"$f":"ROUND(IF(ISERR((F18-E18)/E18), 0, (F18-E18)/E18),4)","v":0},{"$f":"Feasibility!H16","v":0},{"$f":"IF(ISERR((H18-F18)/F18), 0, (H18-F18)/F18)","v":0},{"$f":"Feasibility!I16","v":0},{"$f":"IF(ISERR((J18-H18)/H18), 0, (J18-H18)/H18)","v":0},{"$f":"Feasibility!J16","v":0},{"$f":"IF(ISERR((L18-J18)/J18), 0, (L18-J18)/J18)","v":0},{"$f":"Feasibility!K16","v":0},{"$f":"IF(ISERR((N18-L18)/L18), 0, (N18-L18)/L18)","v":0},{"$f":"IF($B$6=\"Secondary\", 6.9%, 5%)","v":0.05}]
[null,"Parish contributions and SBF - recurrent",{"$f":"Feasibility!D17","v":0},{"$f":"Feasibility!E17","v":0},{"$f":"Feasibility!F17","v":0},{"$f":"Feasibility!G17","v":0},{"$f":"ROUND(IF(ISERR((F19-E19)/E19), 0, (F19-E19)/E19),4)","v":0},{"$f":"Feasibility!H17","v":0},{"$f":"IF(ISERR((H19-F19)/F19), 0, (H19-F19)/F19)","v":0},{"$f":"Feasibility!I17","v":0},{"$f":"IF(ISERR((J19-H19)/H19), 0, (J19-H19)/H19)","v":0},{"$f":"Feasibility!J17","v":0},{"$f":"IF(ISERR((L19-J19)/J19), 0, (L19-J19)/J19)","v":0},{"$f":"Feasibility!K17","v":0},{"$f":"IF(ISERR((N19-L19)/L19), 0, (N19-L19)/L19)","v":0}]
[null,"Other recurrent income",{"$f":"Feasibility!D18","v":0},{"$f":"Feasibility!E18","v":0},{"$f":"Feasibility!F18","v":0},{"$f":"Feasibility!G18","v":0},{"$f":"ROUND(IF(ISERR((F20-E20)/E20), 0, (F20-E20)/E20),4)","v":0},{"$f":"Feasibility!H18","v":0},{"$f":"IF(ISERR((H20-F20)/F20), 0, (H20-F20)/F20)","v":0},{"$f":"Feasibility!I18","v":0},{"$f":"IF(ISERR((J20-H20)/H20), 0, (J20-H20)/H20)","v":0},{"$f":"Feasibility!J18","v":0},{"$f":"IF(ISERR((L20-J20)/J20), 0, (L20-J20)/J20)","v":0},{"$f":"Feasibility!K18","v":0},{"$f":"IF(ISERR((N20-L20)/L20), 0, (N20-L20)/L20)","v":0},0.03]
[null,null,{"$f":"SUM(C17:C20)","v":0},{"$f":"SUM(D17:D20)","v":0},{"$f":"SUM(E17:E20)","v":0},{"$f":"SUM(F17:F20)","v":0},{"$f":"ROUND(IF(ISERR((F21-E21)/E21), 0, (F21-E21)/E21),4)","v":0},{"$f":"SUM(H17:H20)","v":0},{"$f":"IF(ISERR((H21-F21)/F21), 0, (H21-F21)/F21)","v":0},{"$f":"SUM(J17:J20)","v":0},{"$f":"IF(ISERR((J21-H21)/H21), 0, (J21-H21)/H21)","v":0},{"$f":"SUM(L17:L20)","v":0},{"$f":"IF(ISERR((L21-J21)/J21), 0, (L21-J21)/J21)","v":0},{"$f":"SUM(N17:N20)","v":0},{"$f":"IF(ISERR((N21-L21)/L21), 0, (N21-L21)/L21)","v":0}]
[]
[null,"15% of Recurrent Income and Capital Fees $ value   ",{"$f":"(C21+Feasibility!D32)*C24","v":0},{"$f":"(D21+Feasibility!E32)*D24","v":0},{"$f":"(E21+Feasibility!F32)*E24","v":0},{"$f":"(F21+Feasibility!G32)*F24","v":0},null,{"$f":"(H21+Feasibility!H32)*H24","v":0},null,{"$f":"(J21+Feasibility!I32)*J24","v":0},null,{"$f":"(L21+Feasibility!J32)*L24","v":0},null,{"$f":"(N21+Feasibility!K32)*N24","v":0}]
[null,null,0.15,0.15,0.15,0.15,null,0.15,null,0.15,null,0.15,null,0.15]
["TOTAL RECURRENT EXPENDITURE"]
[null,"Salaries",{"$f":"Feasibility!D22","v":0},{"$f":"Feasibility!E22","v":0},{"$f":"Feasibility!F22","v":0},{"$f":"Feasibility!G22","v":0},{"$f":"ROUND(IF(ISERR((F26-E26)/E26), 0, (F26-E26)/E26),4)","v":0},{"$f":"Feasibility!H22","v":0},{"$f":"IF(ISERR((H26-F26)/F26), 0, (H26-F26)/F26)","v":0},{"$f":"Feasibility!I22","v":0},{"$f":"IF(ISERR((J26-H26)/H26), 0, (J26-H26)/H26)","v":0},{"$f":"Feasibility!J22","v":0},{"$f":"IF(ISERR((L26-J26)/J26), 0, (L26-J26)/J26)","v":0},{"$f":"Feasibility!K22","v":0},{"$f":"IF(ISERR((N26-L26)/L26), 0, (N26-L26)/L26)","v":0},3.5000000000000003E-2]
[null,"Interest expense",{"$f":"Feasibility!D23","v":0},{"$f":"Feasibility!E23","v":0},{"$f":"Feasibility!F23","v":0},{"$f":"Feasibility!G23","v":0},{"$f":"ROUND(IF(ISERR((F27-E27)/E27), 0, (F27-E27)/E27),4)","v":0},{"$f":"Feasibility!H23","v":0},{"$f":"IF(ISERR((H27-F27)/F27), 0, (H27-F27)/F27)","v":0},{"$f":"Feasibility!I23","v":0},{"$f":"IF(ISERR((J27-H27)/H27), 0, (J27-H27)/H27)","v":0},{"$f":"Feasibility!J23","v":0},{"$f":"IF(ISERR((L27-J27)/J27), 0, (L27-J27)/J27)","v":0},{"$f":"Feasibility!K23","v":0},{"$f":"IF(ISERR((N27-L27)/L27), 0, (N27-L27)/L27)","v":0},0.03]
[null,"Other recurrent expenditure",{"$f":"Feasibility!D24","v":0},{"$f":"Feasibility!E24","v":0},{"$f":"Feasibility!F24","v":0},{"$f":"Feasibility!G24","v":0},{"$f":"ROUND(IF(ISERR((F28-E28)/E28), 0, (F28-E28)/E28),4)","v":0},{"$f":"Feasibility!H24","v":0},{"$f":"IF(ISERR((H28-F28)/F28), 0, (H28-F28)/F28)","v":0},{"$f":"Feasibility!I24","v":0},{"$f":"IF(ISERR((J28-H28)/H28), 0, (J28-H28)/H28)","v":0},{"$f":"Feasibility!J24","v":0},{"$f":"IF(ISERR((L28-J28)/J28), 0, (L28-J28)/J28)","v":0},{"$f":"Feasibility!K24","v":0},{"$f":"IF(ISERR((N28-L28)/L28), 0, (N28-L28)/L28)","v":0},0.03]
[null,"Less: Depreciation",{"$f":"Feasibility!D26","v":0},{"$f":"Feasibility!E26","v":0},{"$f":"Feasibility!F26","v":0},{"$f":"Feasibility!G26","v":0},null,{"$f":"Feasibility!H26","v":0},null,{"$f":"Feasibility!I26","v":0},null,{"$f":"Feasibility!J26","v":0},null,{"$f":"Feasibility!K26","v":0}]
[null,null,{"$f":"SUM(C26:C28)-C29","v":0},{"$f":"SUM(D26:D28)-D29","v":0},{"$f":"SUM(E26:E28)-E29","v":0},{"$f":"SUM(F26:F28)-F29","v":0},{"$f":"ROUND(IF(ISERR((F30-E30)/E30), 0, (F30-E30)/E30),4)","v":0},{"$f":"SUM(H26:H28)-H29","v":0},{"$f":"IF(ISERR((H30-F30)/F30), 0, (H30-F30)/F30)","v":0},{"$f":"SUM(J26:J28)-J29","v":0},{"$f":"IF(ISERR((J30-H30)/H30), 0, (J30-H30)/H30)","v":0},{"$f":"SUM(L26:L28)-L29","v":0},{"$f":"IF(ISERR((L30-J30)/J30), 0, (L30-J30)/J30)","v":0},{"$f":"SUM(N26:N28)-N29","v":0},{"$f":"IF(ISERR((N30-L30)/L30), 0, (N30-L30)/L30)","v":0}]
{"$rows_left_out":52}
{"sheet":"Comments","index":7,"n_rows":1,"n_cols":3,"rows_kept":1,"cut":false,"hidden":true,"merged":[]}
["Item","Year","Comment"]