{"text_format":"1","workbook":"xlsx","n_sheets":18,"sheets":["StrataCorners","SpeciesList","QuickHelp","Set-MGM","NLRYields","UserWorkArea","Crop Plans","Record","Yields","YieldTables","Charts","MyCharts","Graphs","Stand","Stand Table","Batch Log","Trees","SVS Images"],"not_rendered":{"charts":37,"images":3,"macros":1,"external_links":0,"defined_names":278,"comments":6,"pivot_tables":1},"unopened":[],"bounds":{"document_bytes":16777216,"sheet_cells":100000,"rows_first":2000,"rows_last":500,"rows_between":2000,"halvings":0,"cell_chars":16384,"cell_head_chars":4096},"cells_cut":0,"cells_raw":0,"read":"whole","date_system":"1900"}

{"sheet":"StrataCorners","index":0,"n_rows":6,"n_cols":9,"rows_kept":6,"cut":false,"hidden":true,"merged":[]}
["This worksheet contains a list of the corners (vertices) of polygons enclosing each stratum. Strata from multiple blocks (or crop plans) may be included. Strata names must be unique."]
["Strata may be in any order, but within a strarum the corners must be in a rational order - i.e. sequenced as if you are traversing clockwise or anticlockwise around each stratum boundary. "]
["The starting corner of each stratum should be repeated as the last corner, to close each polygon (this is the Arc GIS output default). Strata that share a boundary will need separate corner coordinates for each stratum."]
["X and Y coordinates can be relative to a single location in the entire block, or UTM coordinates from a GPS or GIS coverage."]
["We recommend you view the strata across the entire block with a Visualize event to ensure you have entered the strata corners and treelists correctly."]
["strataname","xeast","ynorth",null,"Empty (blank) rows are ignored",null,null,null,"Stands workbook: MGM Stands.xlsx"]

{"sheet":"SpeciesList","index":1,"n_rows":49,"n_cols":12,"rows_kept":49,"cut":false,"hidden":true,"merged":[]}
["Species Codes by Region"]
["Notes","On establishment a tree should receive an mgmspp and trspp index. These should not change even if region changes"]
[]
[]
[]
["VBAIndex","shtIndex","IndexMGM","SppGrp","MGM","AB","BC","SK","MB","Utilized","Common Name","Latin Name"]
[0,1,1,"Con","Sw","Sw","Sw","wS","WS",null,"White spruce","P. glauca"]
[1,2,2,"Con","Pl","Pl","Pl","lP","LP",null,"Lodgepole pine","P. contorta"]
[2,3,3,"Dec","Aw","Aw","At","tA","TA",null,"Aspen","P. tremuloides"]
[3,4,4,"Con","Sb","Sb","Sb","bS","BS",null,"Black spruce","P. mariana"]
[4,5,3,"Dec","Aw","Bw","Ep","wB","WB",null,"Paper (White) Birch","B. papyrifera"]
[5,6,3,"Dec","Aw","Pb","Ac","bP","BA",null,"Balsam Poplar/Black Cottonwood","P. balsamifera "]
[6,7,3,"Dec","Aw","Pb","Acb","bP","BA",null,"Balsam Poplar","P. balsamifera ssp. balsamifera"]
[7,8,3,"Dec","Aw","NA","Act","NA","NA",null,"Black cottonwood","P. balsamifera  ssp. trichocarpa"]
[8,9,2,"Con","Pl","Pj","Pj","jP","JP",null,"Jack pine","P. banksiana"]
[9,10,1,"Con","Sw","Fa","Bg","NA","NA",null,"Sub-alpine fir","A. lasiocarpa"]
[10,11,4,"Con","Sb","Lt","Lt","tL","TL",null,"Tamarack","L. Laricina"]
[11,12,4,"Con","Sb","La","La","NA","NA",null,"Subalpine Larch","L. Lyallii"]
[12,13,4,"Con","Sb","Lw","Lw","NA","NA",null,"Western larch","L. occidentalis"]
[13,14,2,"Con","Pl","Pf","Pf","NA","NA",null,"Limber pine","P. flexilis"]
[14,15,2,"Con","Pl","NA","Py","NA","NA",null,"Ponderosa pine","P. ponderosa"]
[15,16,2,"Con","Pl","Pw","Pa","NA","NA",null,"Whitebark pine","P. albicaulis"]
[16,17,1,"Con","Sw","Se","Se","NA","NA",null,"Engelmann spruce","P. engelmannii"]
[17,18,1,"Con","Sw","NA","Sx","NA","NA",null,"Spruce hybrid  ","Picea crosses"]
[18,19,1,"Con","Sw","NA","Fd","NA","NA",null,"Douglasfir","P. menziesii"]
[19,20,1,"Con","Sw","Fd","Fdi","NA","NA",null,"Douglasfir – Interior","P. menziesii var glauca"]
[20,21,1,"Con","Sw","Fb","Bb","bF","BF",null,"Balsam fir","A. balsamea"]
[21,22,3,"Dec","Aw","NA","NA","mM","MM",null,"Manitoba maple","A. negundo"]
[22,23,3,"Dec","Aw","NA","NA","bO","BO",null,"Bur oak","Q. macrocarpa"]
[23,24,3,"Dec","Aw","NA","NA","wE","WE",null,"White elm","U. americana"]
[]
["Count of species codes (except NA)",null,null,null,{"$f":"COUNTA(E7:E30)-COUNTIF(E7:E30,\"NA\")","v":24},{"$f":"COUNTA(F7:F30)-COUNTIF(F7:F30,\"NA\")","v":17},{"$f":"COUNTA(G7:G30)-COUNTIF(G7:G30,\"NA\")","v":21},{"$f":"COUNTA(H7:H30)-COUNTIF(H7:H30,\"NA\")","v":13},{"$f":"COUNTA(I7:I30)-COUNTIF(I7:I30,\"NA\")","v":13}]
[]
["Lookup test formulas"]
[null,null,null,null,"Region",1,2,3,4]
[null,null,null,null,"Spp","fb","sx","jp","wb"]
[null,null,null,null,"SppIndex",{"$f":"CHOOSE(F35,MATCH(F36,$F$7:$F$30,0),MATCH(F36,$G$7:$G$30,0),MATCH(F36,$H$7:$H$30,0),MATCH(F36,$I$7:$I$30,0))","v":21},{"$f":"CHOOSE(G35,MATCH(G36,$F$7:$F$30,0),MATCH(G36,$G$7:$G$30,0),MATCH(G36,$H$7:$H$30,0),MATCH(G36,$I$7:$I$30,0))","v":18},{"$f":"CHOOSE(H35,MATCH(H36,$F$7:$F$30,0),MATCH(H36,$G$7:$G$30,0),MATCH(H36,$H$7:$H$30,0),MATCH(H36,$I$7:$I$30,0))","v":9},{"$f":"CHOOSE(I35,MATCH(I36,$F$7:$F$30,0),MATCH(I36,$G$7:$G$30,0),MATCH(I36,$H$7:$H$30,0),MATCH(I36,$I$7:$I$30,0))","v":5}]
[null,null,null,null,"SppMGM",{"$f":"IF(F36=\"NA\",-1,INDEX($E$7:$E$30,CHOOSE(F35,MATCH(F36,$F$7:$F$30,0),MATCH(F36,$G$7:$G$30,0),MATCH(F36,$H$7:$H$30,0),MATCH(F36,$I$7:$I$30,0))))","v":"Sw"},{"$f":"INDEX($E$7:$E$30,CHOOSE(G35,MATCH(G36,$F$7:$F$30,0),MATCH(G36,$G$7:$G$30,0),MATCH(G36,$H$7:$H$30,0),MATCH(G36,$I$7:$I$30,0)))","v":"Sw"},{"$f":"INDEX($E$7:$E$30,CHOOSE(H35,MATCH(H36,$F$7:$F$30,0),MATCH(H36,$G$7:$G$30,0),MATCH(H36,$H$7:$H$30,0),MATCH(H36,$I$7:$I$30,0)))","v":"Pl"},{"$f":"INDEX($E$7:$E$30,CHOOSE(I35,MATCH(I36,$F$7:$F$30,0),MATCH(I36,$G$7:$G$30,0),MATCH(I36,$H$7:$H$30,0),MATCH(I36,$I$7:$I$30,0)))","v":"Aw"}]
[null,null,null,null,"SppIndexMGM",{"$f":"IF(F36=\"NA\",-1,INDEX($C$7:$H$30,CHOOSE(F35,MATCH(F36,$F$7:$F$30,0),MATCH(F36,$G$7:$G$30,0),MATCH(F36,$H$7:$H$30,0),MATCH(F36,$I$7:$I$30,0)),1))","v":1},{"$f":"IF(G36=\"NA\",-1,INDEX($C$7:$H$30,CHOOSE(G35,MATCH(G36,$F$7:$F$30,0),MATCH(G36,$G$7:$G$30,0),MATCH(G36,$H$7:$H$30,0),MATCH(G36,$I$7:$I$30,0)),1))","v":1},{"$f":"IF(H36=\"NA\",-1,INDEX($C$7:$H$30,CHOOSE(H35,MATCH(H36,$F$7:$F$30,0),MATCH(H36,$G$7:$G$30,0),MATCH(H36,$H$7:$H$30,0),MATCH(H36,$I$7:$I$30,0)),1))","v":2},{"$f":"IF(I36=\"NA\",-1,INDEX($C$7:$H$30,CHOOSE(I35,MATCH(I36,$F$7:$F$30,0),MATCH(I36,$G$7:$G$30,0),MATCH(I36,$H$7:$H$30,0),MATCH(I36,$I$7:$I$30,0)),1))","v":3}]
[null,null,null,null,"Sppgrp",{"$f":"INDEX(SppGrp,MATCH(\"AW\",AB,0))","v":"Dec"}]
[]
[]
["Summary of Groupings",null,null,null,"Sw","Sw Se Fd Fb Fa","S Se Sx Sw Fdi Bb Bg","wS bF ","WS BF"]
[null,null,null,null,"Pl","Pl Pj Pf Pw","Pl Pj Pf Py Pa ","lp jP","LP JP"]
[null,null,null,null,"Aw","Aw Pb Bw","At Ac Ep","wB tA bP mM bM wE","TA BA WB"]
[null,null,null,null,"Sb","Sb Lt Lw La","Sb Lt Lw La ","bS tL ","BS TL "]
[]
[null,null,null,null,null,"LFS groups (VSR): Sw Se, Sb, Fb, Pl Pj Pw Pf, Aw, Bw, Lt Lw La Fa, Fd, Pb"]
[null,null,null,null,null,"LFS groups (ECO): Aw, Bw, Fb, Fd, Lt, Pb, Pj, Pl, Sb, Se, Sw"]

{"sheet":"QuickHelp","index":2,"n_rows":51,"n_cols":22,"rows_kept":51,"cut":false,"hidden":true,"merged":[]}
["Topic","HelpEntry",null,"This input dialog window is not modal; can view and move between worksheets. \r\n\r\n\r\n"]
["About MGM Tips and Tricks","This dialog shows many useful tips and tricks. It is activated from the MGM controls group within the MGM tab. While active you may use the Basic User Interface (BUI) or the Advanced User Interface (AUI). However, be careful not to accidentally hide Tips  dialog window behind the BUI dialog window.",null,"Selected Profile row:",4]
["Installation","Essential MGM template files are installed before you work with MGM. If access to the Excel templates directory is denied, the files are created in the MGM workbook directory. After installation is completed, the original downloaded MGM workbook closes automatically aad A COPY of the MGM workbook is created in the MGM workbook directory with a name ending with '- My Working Copy'. USE THIS COPY to complete your analyses. Leave the original downloaded MGM workbook as a backup. A NEW MGM workbook can also be created directly from the Excel 'My Templates' directory. "]
["Getting hints using \"mouse-over\"","Moving the mouse over a control (button or menu item) without clicking the mouse will display information about the control and it's use. You may need to pause a few seconds before the information appears.",null,"Default","Options","Region := 1","SubRegion := 7","StandsWbkName := ","_MinDbh := 0","_topdib := 0","_StumpHt := 0","_VolumeLoss := 0","AllowIngrowth := False","Default_Sindex := 16 18 18 10","YearsToBH := 15 10 2 20","MaxDenAdj := 1 1 1 1","SppUtilStr := 111111111111111111111111","MAFlag := False","FlagABnewSI := False","FlagHDSMooth := False","FlagVSTO := True","FlagMSLight := False"]
["MGM Ribbon","When the MGM workbook is opened, the MGM Ribbon is created. It contains controls (buttons and menus) that allow you to interact with MGM to make growth projections. The Basic User Interface BUI) consists of one group of controls while the Advanced User Interface (AUI) includes several additional groups of controls. Since MGM settings are saved with the MGM workbook, you can determine how MGM will behave on startup; you can have the workbook begin with either the Basic or Advanced User Interface. ",null,"DMI","Options","Region := 1","SubRegion := 15","StandsWbkName := ","_MinDbh := 0","_topdib := 0","_StumpHt := 0","_VolumeLoss := 0","AllowIngrowth := False","Default_Sindex := 16 18 18 10","YearsToBH := 15 10 2 20","MaxDenAdj := 1 1 1 1","SppUtilStr := 111111111111111111111111","MAFlag := False","FlagABnewSI := False","FlagHDSMooth := False","FlagVSTO := True","FlagMSLight := False"]
["MGM button group","This group of controls is located in the MGM Ribbon. It allows access to  1) Preferences for the MGM Basic and Advanced User Interface, 2) MGM help information,  and 3) a few MGM tools. Other settings may also appear in this group of controls.",null,"ALP","Options","Region := 1","SubRegion := 7","StandsWbkName := ","_MinDbh := 0","_topdib := 0","_StumpHt := 0","_VolumeLoss := 0","AllowIngrowth := False","Default_Sindex := 16 18 18 10","YearsToBH := 15 10 2 20","MaxDenAdj := 1 1 1 1","SppUtilStr := 111111111111111111111111","MAFlag := False","FlagABnewSI := False","FlagHDSMooth := False","FlagVSTO := True","FlagMSLight := False"]
["Preferences menu","This menu contains controls that allow you to start the Basic User Interface (BUI). When the workbook is saved, the current BUI Preferences are saved. If BUI is active(visible) when the workbook is saved, the next session will automatically start BUI. Other user preference settings may also appear on the Preferences menu.",null,"WGP","Options","Region := 1","SubRegion := 11","StandsWbkName := ","_MinDbh := 0","_topdib := 0","_StumpHt := 0","_VolumeLoss := 0","AllowIngrowth := False","Default_Sindex := 16 18 18 10","YearsToBH := 15 10 2 20","MaxDenAdj := 1 1 1 1","SppUtilStr := 111111111111111111111111","MAFlag := False","FlagABnewSI := False","FlagHDSMooth := False","FlagVSTO := True","FlagMSLight := False"]
["Help menu","This menu allows access to several sources of intormation about MGM.",null,"SRD","Options","Region := 1","SubRegion := 7","StandsWbkName := ","_MinDbh := 0","_topdib := 0","_StumpHt := 0","_VolumeLoss := 0","AllowIngrowth := False","Default_Sindex := 16 18 18 10","YearsToBH := 15 10 2 20","MaxDenAdj := 1 1 1 1","SppUtilStr := 111111111111111111111111","MAFlag := False","FlagABnewSI := False","FlagHDSMooth := False","FlagVSTO := True","FlagMSLight := False"]
["MGM Tools menu","This menu allows access to a few tools useful in using MGM.",null,"NWT","Options","Region := 1","SubRegion := 7","StandsWbkName := ","_MinDbh := 0","_topdib := 0","_StumpHt := 0","_VolumeLoss := 0","AllowIngrowth := False","Default_Sindex := 16 18 18 10","YearsToBH := 15 10 2 20","MaxDenAdj := 1 1 1 1","SppUtilStr := 111111111111111111111111","MAFlag := False","FlagABnewSI := False","FlagHDSMooth := False","FlagVSTO := True","FlagMSLight := False"]
["Basic User Interface (BUI)","The Basic User Interface (BUI) is is a useful learning and analysis tool for MGM. It shows a simple dialog that can make and summarize MGM growth projection 'Runs' (Crop Plans) subject to a number of limitations. For some users the BUI may be all that is required. \n\nBUI permits access to the MGM controls group and gives access to MGM Help as well the selected other MGM controls. The entire set of growth runs may be made visible or hidden, charts may be viewed and runs may be added (at the end of the sequence) or deleted. To view various results, switch between worksheets using the tabs at the bottom of the MGM window.\n\nIf you need to make more complex projections with greater  control of the Crop Plan, the migration to using the Advanced User Interface (AUI) will be easier after some experience using BUI. If the MGM workbook is saved and closed while BUI is active, then the next session begins in BUI. From the AUI, the BUI is activated using a button in the MGM Preferences menu in the MGM controls group. ",null,"SSK","Options","Region := 1","SubRegion := 7","StandsWbkName := ","_MinDbh := 0","_topdib := 0","_StumpHt := 0","_VolumeLoss := 0","AllowIngrowth := False","Default_Sindex := 16 18 18 10","YearsToBH := 15 10 2 20","MaxDenAdj := 1 1 1 1","SppUtilStr := 111111111111111111111111","MAFlag := False","FlagABnewSI := False","FlagHDSMooth := False","FlagMSLight := False"]
["Advanced User Interface (AUI)","This set of tools appears as other groups of controls in the MGM ribbon. It provides the greatest flexibility for analysts, but also requires greater effort and care in learning and using these controls. If AUI is active and the workbook is saved, it will be active when the next session begins.",null,"LPSR","Options","Region := 1","SubRegion := 7","StandsWbkName := ","_MinDbh := 0","_topdib := 0","_StumpHt := 0","_VolumeLoss := 0","AllowIngrowth := False","Default_Sindex := 16 18 18 10","YearsToBH := 15 10 2 20","MaxDenAdj := 1 1 1 1","SppUtilStr := 111111111111111111111111","MAFlag := False","FlagABnewSI := False","FlagHDSMooth := False","FlagMSLight := False"]
["About Crop Plans (CP)","A crop plan consist of a sequence of CP events that govern the projection of a stand using MGM. The purpose of the BUI is to ease the transition from basic projections to using the greater flexibility available with Crop Plans and the AUI.",null,"LPDC","Options","Region := 1","SubRegion := 7","StandsWbkName := ","_MinDbh := 0","_topdib := 0","_StumpHt := 0","_VolumeLoss := 0","AllowIngrowth := False","Default_Sindex := 16 18 18 10","YearsToBH := 15 10 2 20","MaxDenAdj := 1 1 1 1","SppUtilStr := 111111111111111111111111","MAFlag := False","FlagABnewSI := False","FlagHDSMooth := False","FlagMSLight := False"]
["About Crop Plans worksheet Shortcut Menu","The CP shortcut menu menu provides quick access to buttons (tools) for managing CP events and projecting growth. It is ONLY available within the Crop Plans worksheet. To activate the menu simply right-click on any CP event row. The right-click action immediately selects the same row as the active (highlighted) event. DO NOT USE THE CP SHORTCUT MENU WHILE BUI IS ACTIVE.",null,"CFS","Options","Region := 1","SubRegion := 7","StandsWbkName := ","_MinDbh := 0","_topdib := 0","_StumpHt := 0","_VolumeLoss := 0","AllowIngrowth := False","Default_Sindex := 16 18 18 10","YearsToBH := 15 10 2 20","MaxDenAdj := 1 1 1 1","SppUtilStr := 111111111111111111111111","MAFlag := False","FlagABnewSI := False","FlagHDSMooth := False","FlagMSLight := False"]
["Set Workbook Names ","When Setting workbook names (Crop Plans, Stands, Records), workbooks located in a subdirectory of the MGM workbook directory can be accessed by including the path name in front  the workbook  name. The backslash (\\) directory separater is required between the path and workbook name but must NOT appear before the path name. For example: 'MySubdiretory\\MyWorkbook.xlsx' (entered without the single quotes).\n\nThe Stands workbook name can be set using the Set Workbook Names dialog OR the Options event--Other Settings tab. Using the options event setting allows use of several Stands workbooks without using the Set Workbook Names dialog.  Remember that the name remains in effect until it is changed by another Options event or the set names dialog.",null,"CFR","Options","Region := 1","SubRegion := 7","StandsWbkName := ","_MinDbh := 0","_topdib := 0","_StumpHt := 0","_VolumeLoss := 0","AllowIngrowth := False","Default_Sindex := 16 18 18 10","YearsToBH := 15 10 2 20","MaxDenAdj := 1 1 1 1","SppUtilStr := 111111111111111111111111","MAFlag := False","FlagABnewSI := False","FlagHDSMooth := False","FlagMSLight := False"]
["Crop Plans (CP) workbook","The CP workbook provides a repository for a collection of CP worksheets. These can easily be saved, retrieved, and executed  to project stand growth under a variety of scenarios.",null,"WFR","Options","Region := 1","SubRegion := 7","StandsWbkName := ","_MinDbh := 0","_topdib := 0","_StumpHt := 0","_VolumeLoss := 0","AllowIngrowth := False","Default_Sindex := 16 18 18 10","YearsToBH := 15 10 2 20","MaxDenAdj := 1 1 1 1","SppUtilStr := 111111111111111111111111","MAFlag := False","FlagABnewSI := False","FlagHDSMooth := False","FlagMSLight := False"]
["Stands workbook","The Stands workbook provides a primary means to incorporate real tree data into a CP. Use the Establish event to specify which stand from the Stands workbook is to be established. \n\nThe Stands workbook name can be set using the Set Workbook Nnames dialog or the Options event--Other Settings tab. Using the options event setting allows use of several Stands workbooks without using the Set Workbook Names dialog.  Remember that the name remains in effect until it is changed by another Options event or the set names dialog."]
["The Records workbook","The Records workbook is a repository for results of projecting stand growth for all or part of the active CP worksheet. The current Records worksheet can be saved into the MGM Records workbook. Variations of the same CP can be saved with different names;  simply append or change the name in cell C2 (keep it short and simple) before clicking the save button on the MGM tab."]
["Crop Plans (CP) worksheet","One or more Crop Plans (CP) may be created and placed into the CP worksheet. An entire CP is easily selected using the CP shortcut menu; it can then be copied, pasted and modified to create other CP on the CP worksheet. The Crop Plans worksheet can be saved by clicking the Save Worksheet button. A shortcut menu is available and is accessed by right-clicking on any CP event."]
["Stand worksheet","The Stand worksheet has many comments that can viewed by moving the cursor onto the cell with a red triangle symbol in the upper right corner. Worksheet comments can be displayed (or hidden) by selecting the 'Comments' item on the View menu."]
["Record worksheet","This worksheet provides a log of projection as well a tabulation of all results. Error messages, if any, appear here"]
["Yields worksheet","This worksheet shows the stand yields at the most recent reporting age (usually the last event executed). Worksheet comments can be displayed (or hidden) by selecting the 'Comments' item on the View menu."]
["Charts, MyCharts, and Graphs worksheets","These worksheets provide graphic summaries of the Yields for all CP projections. MyCharts can be customized by the user. Charts can easily be copied and pasted as pictures into other documents for reporting purposes."]
["Edit event settings (Options)","Select a Region and subRegion. Review and revise merchantability, species and other settings as desired. Setting Allow Ingrowth increases the time for a growth projection substantially. "]
["Edit event settings (Establish)","Select an establishment method and make appropriate settings for retrieving or simulating tree data. See the web Help files for additional notes on setting the values for each cohort of trees to be simulated."]
["Edit event settings (Grow)","Age must be greater than the event stand age and separated by spaces. Multi-event growth schedules place each reporting age into a separate event row. This facilitates inserting other actions like thinning or removal."]
["Edit event settings (Thin)","Select a tree removal rule, removal amount rule, and a removal amount. Amounts should be greater than 0 and <= all trees."]
["Save CP, Stands and Records worksheets","While the BUI is active you my save CP, Records and YieldTables worksheets (for some users this button may be disabled in the BUI Preferences). The CP and Records worksheets are saved to corresponding workbooks while the YieldTables worksheet is saved to a new workbook.\n\nWhile the AUI is active you may save your CP, Records, and Stands worksheets for future reference, retrieval and analysis using the 'Save Worksheet' button found in the 'Crop Plans (CP)' group. The ACTIVE worksheet (ONLY CP, Stand or Record) is saved to the corresponding workbook (Crop Plans, Stands, or Record)."]
[]
[]
[]
["Topic or Menu item","Developer Tip"]
["The MGM Developer Group ","These buttons provide tools for the developer; they are normally visible in Author and Alpha workbooks but not in Beta and Distribution workbooks; in Author and Alpha workbooks the MGM Developer group can be set to hidden or visible from the MGM Tools menu in the MGM group."]
["Developer Tips","This button invokes the series of topics for the Developer button group"]
["Developer Diary","Invokes a dialog to place information in the diary about changes to the workbook."]
["Execute Validation Workbook","dialog for setting inputs for MB validation runs"]
["Basic User Interface (BUI)","This interface provides a simplified user dialog for making MGM growth projections. Several limitations are imposed along with a few assumptions (mainly the coefficient of variation for simulation of trees and restriction to two cohorts of trees) about input parameters for stand simulation. "]
["If MGM Crashes (hopefully rarely)","MGM internals and ribbon tab destroyed on 'VBA loss of state' error. If MGM crashes the VBA 'state' is lost. All memory values and the MGM tab ribbon are destroyed. The ribbon may still be visible, but will not function correctly.  I found a workaround on the internet and this new button does very well to recover and restore the ribbon. However, the user must click the button for it to work. Before I found this workaround, the ribbon could only be restored by exiting and reopening the workbook. Hopefully in the distribution version this 'loss of state' will rarely occur. I have integrated this code into the basic MGM button group."]
["More Tools","A sub-menu that contains a collection of other useful tools and procedures; items in the following rows are found in this menu."]
["Make workbook summary lists","These information buttons create lists of formulas, names, and VBA calls that are then placed in new worksheets; these are mainly documentation tools"]
["Manage Worksheets","Dialog to show, hide, or delete worksheets"]
["Protect Workbook structure","Toggle between protected and unprotected workbook structure; normally unprotected for Author and Alpha versions; protected for Beta and Distribution versions"]
["Protect Worksheets","Toggles worksheet protection; Normally protected for all user levels; available if manual changes for testing are needed, particularly in the Stand worksheet"]
["Show Merchantable Stand Summary","Toggle  between Total and Merchantable stand summary characteristics; \n\nTotal: Most Stand Summary Statistics include all trees with HT > 1.3 m; these values are used for internal growth and survival functions\n\nMerchantable: Most Stand Summary Statistics include merchantable trees of utilized species; these values appear in the Yields worksheet"]
["Delete chart objects in active worksheet","The title tells it all but remember it is the ACTIVE worksheet"]
["Execute only the current event","Useful for stepping through a CP"]
["Execute selected CP rows","Useful for executing some but not all events in a CP sequence; normally starts with the stand as of last executed CP event"]
["Execute one year projection","Projects current stand for one year; beware that this takes the current stand configuration (after last executed CP event)"]
["Set User Level","Dialog to set user level; may be used for testing; not normally needed"]
["Update Version ID","When the MGM workbook is saved and userLevel = user.Author, the Revision number is automatically increased by 1;   btnUpdateVersionID may also be called manually from VBA immediate window or from Developer Tools menu when special updates are needed for a Distribution copy of the workbook;  this is usually required when addressing last minute fixes or special tests; special labeling of versionID can be added by setting Global variable VersionIDSpecialMsg found in mdl_Initialize."]
["Save MGM Template files","Two template files are created in the Excel templates directory; one for the MGM workbook and one for the MGM Stand worksheet; this button allows for manually saving these during development; normally they are created during when a new alpha, beta, or distribution workbook is first opened by the user."]
["Make alpha, beta, or distribution worknbook","Dialogs to create user ready workbooks; alpha ONLY for developers testing; beta for trusted other testers (22 Feb 2011 no difference between beta and distrution copies); Distribution copy for cleaning and distribution"]

{"sheet":"Set-MGM","index":3,"n_rows":208,"n_cols":22,"rows_kept":208,"cut":false,"hidden":true,"merged":[]}
[]
["Worksheet Defined Name","Value (additional values may extend into cells to the right)"]
["MGMVersion","MGM21A Dist Beta VS39 (Rev 6426) 17:39 30 Mar 2024"]
["MGMInstallationFlag",false]
["FlagStartup",false]
["MyRibbonPtr",2000552851840]
["MGMCropPlansDBName","MGM Crop Plans.xlsx"]
["MGMStandsDBName","MGM Stands.xlsx"]
["MGMRecordsDBName","MGM Records.xlsx"]
["SVSexeFullName","C:\\Program Files (x86)\\SVS\\winsvs.exe"]
["txtMGMNotes"]
["chkMGMNotes",false]
["UserLevel",0]
["speakON",false]
["AdvMGMTab",true]
["HideNavBtns",false]
["BUIShowCPBtn",true]
["BUIShowAUIBtn",true]
["BUISaveWorksheetsBtn",true]
["BUIShowGrowthInfoMsg",true]
["TempCells"]
["Region",1]
["SubRegion",1]
["minDBH",0]
["topDIB",0]
["stumpHT",0]
["VolumeLoss",0]
["AllowIngrowth",false]
["SIDefaultStr","19.0 19.3 21.1 15.7"]
["YearsToBHstr","12 8 4 15"]
["MaxDenAdjstr","1 1 1 1"]
["SppUtilStr","111111111111111111111111"]
["SImodCurveSet",0]
["FlagAgeSolver",true]
["FlagSImod",false]
["FlagMA",false]
["FlagABnewSI",true]
["FlagHDSmooth",false]
["FlagVSTO",true]
["FlagMSLight",false]
["FlagMSS",false]
["FlagSbNewGrowth",true]
["FlagNewMaxDen",true]
["FlagNewGMort",true]
["FlagSwRResp",true]
["FlagMGM10",false]
["flagMGM18",false]
["FlagTestTrAgeInStdWs",false]
[]
["Range name:  SimJuvTreesTbl1 -- Weibull CDF coeff lookup for use in SimJuvTrees"]
["lookupSpp","Sw"]
["lookupyear",6]
["B",{"$f":"VLOOKUP($B$51&$B$52,$A$56:$E$74,4,FALSE)","v":6.4016299999999999},{"$f":"INDEX($D$56:$D$74,MATCH($B$51&$B$52,$B$56:$B$74&$C$56:$C$74,0))","v":6.4016299999999999}]
["C",{"$f":"VLOOKUP($B$51&$B$52,$A$56:$E$74,5,FALSE)","v":2.7536900000000002},{"$f":"INDEX($E$56:$E$74,MATCH($B$51&$B$52,$B$56:$B$74&$C$56:$C$74,0))","v":2.7536900000000002}]
[]
["key","spp","year","B","C"]
[{"$f":"B57&C57","v":"Pl2"},"Pl",2,1.7933699999999999,3.9845700000000002]
["Pl4","Pl",4,3.8170199999999999,7.7647899999999996]
["Pl6","Pl",6,5.6593600000000004,10.5716]
["Pl8","Pl",8,7.7,16.7]
["Pl10","Pl",10,7.6008300000000002,11.3599]
["Pl12","Pl",12,7.6008300000000002,11.3599]
["Aw2","Aw",2,3.0118999999999998,3.1785000000000001]
["Aw4","Aw",4,3.7467000000000001,2.2721499999999999]
["Aw6","Aw",6,5.6370800000000001,3.4488799999999999]
["Aw8","Aw",8,7.2248099999999997,4.1732100000000001]
["Aw10","Aw",10,8.0081299999999995,5.0194999999999999]
["Aw12","Aw",12,9.0006500000000003,2.07986]
["Sw2","Sw",2,2.68804,2.5971299999999999]
["Sw4","Sw",4,4.79948,4.8579800000000004]
["Sw6","Sw",6,6.4016299999999999,2.7536900000000002]
["Sw8","Sw",8,7.6657799999999998,2.3485999999999998]
["Sw10","Sw",10,8.7507999999999999,2.8540199999999998]
["Sw12","Sw",12,13.485099999999999,3.20553]
[]
["Range name: StandParTbl"]
["Spp","Sw"]
["Age",17]
["Vbl","Height","Dbh","Stems/ha"]
["Site",24,null,null,{"$f":"MATCH(B80,A83:L83,0)","v":11}]
[null,{"$f":"VLOOKUP($B$77&FLOOR($B$78,4)&$B$79,$A$83:$L$146,MATCH(FLOOR($B$80,2),$A$83:$L$83,FALSE),FALSE)","v":6.1},{"$f":"VLOOKUP($B$77&FLOOR($B$78,4)&$C$79,$A$83:$L$146,MATCH(FLOOR($B$80,2),$A$83:$L$83,FALSE),FALSE)","v":7.4},{"$f":"VLOOKUP($B$77&FLOOR($B$78,4)&$D$79,$A$83:$L$146,MATCH(FLOOR($B$80,2),$A$83:$L$83,FALSE),FALSE)","v":800}]
[null,"Table 1.   Approximate Stand Attributes for Components in Mixedwood Stands(columns are site index values)"]
["Key","Spp","Age","Variable",12,14,16,18,20,22,24,26]
[{"$f":"B84&C84&D84","v":"Aw8Dbh"},"Aw",8,"Dbh",0,0,0.5,1.6,3,4.2,6.8,8]
["Aw8Height","Aw",8,"Height",0.7,1.2,1.5,2.1,3.4,4.5999999999999996,5.5,6.7]
["Aw8Stems/ha","Aw",8,"Stems/ha",5320,4910,4460,3970,3450,2900,2310,1710]
["Aw12Dbh","Aw",12,"Dbh",0.6,0.9,1.3,2.7,4.5,6.5,8.9,10.3]
["Aw12Height","Aw",12,"Height",1.5,1.8,2.7,3.8,5.0999999999999996,6.3,7.4,8.5]
["Aw12Stems/ha","Aw",12,"Stems/ha",4280,3940,3580,3190,2770,2330,1860,1370]
["Aw16Dbh","Aw",16,"Dbh",2.1,3,4.4000000000000004,5.6,7.5,9.5,11.2,13.5]
["Aw16Height","Aw",16,"Height",2.2000000000000002,3.2,4.5,5.6,6.8,8.1,9.3000000000000007,10.199999999999999]
["Aw16Stems/ha","Aw",16,"Stems/ha",3660,3380,3070,2730,2370,1990,1590,1180]
["Aw20Dbh","Aw",20,"Dbh",3.8,5.0999999999999996,6.9,8.5,10.199999999999999,12.6,14.3,15.7]
["Aw20Height","Aw",20,"Height",3.6,4.8,6.1,7.3,8.6,9.8000000000000007,10.9,12]
["Aw20Stems/ha","Aw",20,"Stems/ha",3250,2990,2720,2420,2110,1770,1410,1040]
["Aw24Dbh","Aw",24,"Dbh",5.2,6.8,8.6,10.3,12.5,15.4,16.899999999999999,18.399999999999999]
["Aw24Height","Aw",24,"Height",4.8,6.1,7.4,9,10.3,11.6,12.5,13.7]
["Aw24Stems/ha","Aw",24,"Stems/ha",2940,2710,2460,2200,1910,1600,1280,940]
["Aw28Dbh","Aw",28,"Dbh",6.8,8.9,10.8,13.1,15.1,17.399999999999999,18.899999999999999,20.5]
["Aw28Height","Aw",28,"Height",6.2,7.9,9.5,10.7,12,13.3,14.6,15.5]
["Aw28Stems/ha","Aw",28,"Stems/ha",2710,2500,2270,2020,1760,1470,1170,870]
["Aw32Dbh","Aw",32,"Dbh",8.6,11,12.9,14.7,17.5,20.2,22.5,24]
["Aw32Height","Aw",32,"Height",8.4,9.8000000000000007,11.2,12.4,13.7,15,16.2,17.2]
["Aw32Stems/ha","Aw",32,"Stems/ha",2520,2320,2110,1880,1630,1370,1100,810]
["Sw8Dbh","Sw",8,"Dbh",0,0,0,0.8,2.2999999999999998,3.4,4.4000000000000004,5.3]
["Sw8Height","Sw",8,"Height",0.3,0.4,0.8,1.1000000000000001,1.5,2.1,2.7,3.5]
["Sw8Stems/ha","Sw",8,"Stems/ha",4000,3600,3300,2800,2500,2100,1800,1400]
["Sw12Dbh","Sw",12,"Dbh",0,0,1.1000000000000001,2.4,3.8,4.5999999999999996,5.7,7.1]
["Sw12Height","Sw",12,"Height",0.5,0.6,1.3,1.7,2.2999999999999998,3.2,4.5,5.7]
["Sw12Stems/ha","Sw",12,"Stems/ha",3400,2900,2600,2200,1900,1500,1200,900]
["Sw16Dbh","Sw",16,"Dbh",0,0.8,2.1,3.5,5.0999999999999996,6.2,7.4,9.1]
["Sw16Height","Sw",16,"Height",0.7,1.5,2.2000000000000002,2.4,3.3,4.8,6.1,7.3]
["Sw16Stems/ha","Sw",16,"Stems/ha",2800,2400,2000,1800,1500,1100,800,700]
["Sw20Dbh","Sw",20,"Dbh",0.8,2.1,3.9,5.2,6.2,7.4,9.1,10.6]
["Sw20Height","Sw",20,"Height",1.4,2.4,3.1,3.8,4.7,6.2,7.6,9.1]
[{"$f":"B116&C116&D116","v":"Sw20Stems/ha"},"Sw",20,"Stems/ha",2200,1900,1600,1400,1200,900,700,600]
["Sw24Dbh","Sw",24,"Dbh",1.9,3.2,4.8,6.6,8.1,9.5,11,12.4]
["Sw24Height","Sw",24,"Height",2.1,3.3,4.5,5.3,6.3,7.8,9.3000000000000007,10.4]
["Sw24Stems/ha","Sw",24,"Stems/ha",1800,1500,1300,1100,900,800,600,500]
["Sw28Dbh","Sw",28,"Dbh",3.2,4.8,6.3,7.8,9.8000000000000007,11.7,13.6,15]
["Sw28Height","Sw",28,"Height",3.2,4.2,5.6,6.5,8.1,9.9,11.5,12.6]
["Sw28Stems/ha","Sw",28,"Stems/ha",1400,1200,1100,900,800,600,500,400]
["Sw32Dbh","Sw",32,"Dbh",4.8,6.7,8.1,9.6999999999999993,11.6,13.5,15.8,17.5]
["Sw32Height","Sw",32,"Height",4.2,5.3,6.9,8.4,10.3,12.2,13.7,14.8]
["Sw32Stems/ha","Sw",32,"Stems/ha",1050,950,850,750,650,550,450,250]
["Pl8Dbh","Pl",8,"Dbh",0,0.5,1.5,2.4,3.4,4.5,5.8,7.3]
["Pl8Height","Pl",8,"Height",1,1.4,2,2.6,3.2,4,4.8,5.7]
["Pl8Stems/ha","Pl",8,"Stems/ha",5600,5200,4800,4400,4000,3600,3200,2800]
["Pl12Dbh","Pl",12,"Dbh",0.9,1.8,3,4.2,5.6,6.8,8.1999999999999993,9.6999999999999993]
["Pl12Height","Pl",12,"Height",1.8,2.2999999999999998,2.8,3.4,4.0999999999999996,4.8,5.7,6.6]
["Pl12Stems/ha","Pl",12,"Stems/ha",5200,4800,4400,4000,3600,3200,2800,2400]
["Pl16Dbh","Pl",16,"Dbh",2.1,3.4,4.7,5.9,7.4,9.1999999999999993,10.1,12.3]
["Pl16Height","Pl",16,"Height",3,3.4,4,4.5999999999999996,5.3,6,6.8,7.7]
["Pl16Stems/ha","Pl",16,"Stems/ha",4800,4400,4000,3600,3200,2800,2400,2000]
["Pl20Dbh","Pl",20,"Dbh",3.7,4.9000000000000004,6.7,7.7,9.6999999999999993,11.5,12.9,14.7]
["Pl20Height","Pl",20,"Height",4.5,5,5.5,6.1,6.8,7.5,8.4,9.1999999999999993]
["Pl20Stems/ha","Pl",20,"Stems/ha",4400,4000,3600,3300,2900,2500,2100,1700]
["Pl24Dbh","Pl",24,"Dbh",5.3,6.7,8.4,9.5,11.4,13.5,14.6,16.5]
["Pl24Height","Pl",24,"Height",6.3,6.8,7.3,8,8.6,9.4,10.199999999999999,11.1]
["Pl24Stems/ha","Pl",24,"Stems/ha",4000,3600,3300,2900,2500,2100,1700,1400]
["Pl28Dbh","Pl",28,"Dbh",7.1,8.9,10.9,11.9,13.9,15.8,17.5,19.5]
["Pl28Height","Pl",28,"Height",8.5,9,9.5,10.1,10.8,11.6,12.4,13.3]
["Pl28Stems/ha","Pl",28,"Stems/ha",3500,3200,2900,2600,2200,1800,1400,1000]
["Pl32Dbh","Pl",32,"Dbh",9.5,11.1,12.9,14.6,16.5,18.100000000000001,20.5,22.5]
["Pl32Height","Pl",32,"Height",11.1,11.5,12.1,12.7,13.3,14.1,14.9,15.8]
["Pl32Stems/ha","Pl",32,"Stems/ha",3100,2800,2500,2100,1800,1400,1000,600]
[]
["Range name: tblGammaFNS","GammaLN and GammaDist functions"]
["x-input",1.0000000000000001E-5]
["GammaLN result",{"$f":"GAMMALN(B149)","v":11.512919692895826}]
["alpha",4]
["beta",1]
["GammaDIST result",{"$f":"GAMMADIST(B149,B151,B152,)","v":1.6666500000833312E-16}]
[]
[]
["ASRD EcoRegion/subRegion Tree volume functions coefficients list","Spp","subRegionGrp"]
["Key","AW",0,0.79040600000000005,1.0269429999999999,0.99752399999999997,0.60058400000000001,-6.5680000000000002E-2,-0.17380999999999999,0.121363,6.3253000000000004E-2,null,25.6614,-6.8339999999999998E-2,1.1394,null,-0.33056999999999997,1.1066389999999999,9.859999999999999E-4,null,9.1433E-2,1.0770820000000001]
[{"$f":"B157&C157","v":"AW0"},"AW",1,0.94452199999999997,0.93803000000000003,1.001644,0.69536299999999995,-6.7849999999999994E-2,5.0603000000000002E-2,-1.6330000000000001E-2,0.11643199999999999,null,26.548400000000001,-5.6989999999999999E-2,0.98460000000000003,null,0.114041,1.0166040000000001,3.2720000000000002E-3,null,2.4126999999999999E-2,1.081189]
["AW1","AW",2,0.90561499999999995,0.96489400000000003,1.000054,0.55323599999999995,-4.9739999999999999E-2,-0.28077000000000002,0.17068700000000001,7.5788999999999995E-2,null,25.673100000000002,-7.3669999999999999E-2,1.2607999999999999,null,-9.3609999999999999E-2,1.083466,1.2700000000000001E-3,null,0.13526099999999999,1.0727340000000001]
["AW2","AW",3,0.58883799999999997,1.1618949999999999,0.99209599999999998,0.70930000000000004,-7.5450000000000003E-2,-0.11604,4.0948999999999999E-2,0.113638,null,28.074999999999999,-4.8599999999999997E-2,1.2173,null,-1.64652,1.2397050000000001,-1.72E-3,null,0.21134,1.0735730000000001]
["AW3","AW",4,0.84189700000000001,0.99706399999999995,0.99871299999999996,0.53686500000000004,-6.4019999999999994E-2,-0.23447000000000001,0.17996300000000001,3.1550000000000002E-2,null,24.840800000000002,-8.0810000000000007E-2,1.2404999999999999,null,-5.203E-2,1.076457,1.805E-3,null,6.1754999999999997E-2,1.079512]
["AW4","BW",0,0.89435799999999999,1.0077210000000001,0.99138400000000004,-0.48307,0.15559300000000001,-2.27312,1.3265009999999999,0.16889699999999999,null,27.9727,-3.5220000000000001E-2,0.86950000000000005,null,0.30039900000000003,1.157729,-1.9E-3,null,7.7197000000000002E-2,1.0627979999999999]
["BW0","FB",0,1.002016,0.94407600000000003,0.99992099999999995,1.33633,-0.32035000000000002,2.8394970000000002,-1.3248200000000001,7.7451999999999993E-2,null,24.7532,-6.615E-2,1.5694999999999999,null,1.028869,0.97969600000000001,3.078E-3,null,0.28993999999999998,1.0510029999999999]
["FB0","FB",1,0.91864699999999999,0.99022500000000002,0.99729199999999996,1.568514,-0.38425999999999999,3.503466,-1.67719,0.12816900000000001,null,28.631900000000002,-5.2260000000000001E-2,1.4467000000000001,null,0.66402799999999995,1.01972,2.7539999999999999E-3,null,0.24903500000000001,1.0502359999999999]
["FB1","FB",2,1.108006,0.89837999999999996,1.001816,1.338336,-0.30463000000000001,2.6943630000000001,-1.27762,8.7438000000000002E-2,null,24.3383,-6.7070000000000005E-2,1.5909,null,1.265808,0.95220700000000003,3.5270000000000002E-3,null,0.32361600000000001,1.050716]
["FB2","FD",0,0.91315299999999999,0.96438599999999997,0.99839100000000003,1.386315,-0.28649999999999998,1.7838989999999999,-0.91693000000000002,5.883E-2,null,21.329899999999999,-6.0900000000000003E-2,1.5972999999999999,null,-1.68956,1.380771,-4.7000000000000002E-3,null,-9.5250000000000001E-2,1.1231530000000001]
["FD0","LT",0,0.93351700000000004,0.96547099999999997,0.99839299999999997,2.0794549999999998,-0.46203,3.7320570000000002,-1.9501900000000001,0.19042500000000001,null,26.326599999999999,-5.3749999999999999E-2,1.4026000000000001,null,0.499971,1.0656859999999999,2.8990000000000001E-3,null,0.37886999999999998,1.034008]
["LT0","PB",0,0.86117900000000003,0.95148299999999997,1.0009570000000001,0.75258100000000006,-0.16730999999999999,0.69361099999999998,-0.22414000000000001,8.2140000000000008E-3,null,25.57,-5.0500000000000003E-2,0.98650000000000004,null,0.67106200000000005,1.0377179999999999,2.0769999999999999E-3,null,0.14932200000000001,1.117988]
["PB0","PB",1,0.91332899999999995,0.92259000000000002,1.0025740000000001,0.308448,-6.5670000000000006E-2,-0.10213,0.22633600000000001,2.3147999999999998E-2,null,25.141300000000001,-6.4879999999999993E-2,1.3191999999999999,null,0.58707100000000001,1.070632,4.64E-4,null,0.25708500000000001,1.1031500000000001]
["PB1","PB",2,0.80437000000000003,0.98287400000000003,0.99952700000000005,0.99695800000000001,-0.22325,1.1067309999999999,-0.45982000000000001,-3.3899999999999998E-3,null,25.381,-5.0099999999999999E-2,0.92700000000000005,null,0.76235299999999995,1.017031,2.918E-3,null,0.109731,1.1251199999999999]
["PB2","PJ",0,0.940832,0.95557499999999995,0.99933300000000003,0.116311,-2.8170000000000001E-2,-0.38442999999999999,0.30405500000000002,7.2192000000000006E-2,null,31.426300000000001,-3.8879999999999998E-2,1.1278999999999999,null,0.21102000000000001,1.1446270000000001,-1.6100000000000001E-3,null,0.16172700000000001,1.0456719999999999]
["PJ0","PL",0,0.897617,0.98851800000000001,0.99873500000000004,0.675759,-0.13031000000000001,0.57063399999999997,-0.27545999999999998,0.105403,null,29.0075,-4.8590000000000001E-2,1.1781999999999999,null,-0.24529000000000001,1.088419,9.9299999999999996E-4,null,0.28317300000000001,1.0253049999999999]
["PL0","PL",1,0.80064800000000003,1.053544,0.99556800000000001,0.56834700000000005,-0.12511,0.61008499999999999,-0.23844000000000001,4.5398000000000001E-2,null,24.4114,-3.5549999999999998E-2,0.78459999999999996,null,-0.15973999999999999,1.04616,1.804E-3,null,0.24034700000000001,1.020105]
["PL1","PL",2,0.95716400000000001,0.95999199999999996,0.99977400000000005,0.76674699999999996,-0.14076,0.66603699999999999,-0.35504999999999998,0.13214000000000001,null,29.627600000000001,-5.4609999999999999E-2,1.2997000000000001,null,0.58246299999999995,1.034249,1.97E-3,null,0.29401500000000003,1.0245820000000001]
["PL2","PL",3,0.82866499999999998,1.0241960000000001,0.99749200000000005,0.59619299999999997,-0.11878,0.46559099999999998,-0.19617999999999999,8.3094000000000001E-2,null,24.8398,-6.4680000000000001E-2,1.2937000000000001,null,-0.48716999999999999,1.112282,3.4699999999999998E-4,null,0.30825799999999998,1.0245489999999999]
["PL3","PL",4,1.0335719999999999,0.91362100000000002,1.0007649999999999,0.256633,-4.9090000000000002E-2,-0.25212000000000001,0.17426700000000001,0.123722,null,23.951799999999999,-7.8649999999999998E-2,1.4813000000000001,null,-0.32152999999999998,1.1758960000000001,-1.65E-3,null,0.189744,1.04681]
["PL4","SB",0,0.94069499999999995,0.95721100000000003,0.99963999999999997,1.3957839999999999,-0.34466999999999998,2.8359169999999998,-1.39646,0.15248700000000001,null,24.575099999999999,-5.432E-2,1.2242999999999999,null,0.53612499999999996,0.996309,4.6169999999999996E-3,null,0.38274599999999998,1.0334049999999999]
["SB0","SB",1,0.95762400000000003,0.94674000000000003,1.0004519999999999,1.4304619999999999,-0.35670000000000002,2.9507249999999998,-1.45547,0.15426300000000001,null,24.930499999999999,-5.2810000000000003E-2,1.2552000000000001,null,0.98279300000000003,0.94327899999999998,6.3439999999999998E-3,null,0.41461399999999998,1.0307809999999999]
["SB1","SB",2,0.929037,0.96771799999999997,0.99851100000000004,1.2365969999999999,-0.30819999999999997,2.535507,-1.2220599999999999,0.14624300000000001,null,24.366599999999998,-5.7750000000000003E-2,1.2313000000000001,null,0.125198,1.0585880000000001,2.137E-3,null,0.34976499999999999,1.036689]
["SB2","SE",0,1.072576,0.89776599999999995,1.001919,1.3018339999999999,-0.30543999999999999,2.265717,-1.1196699999999999,0.123519,null,36.318399999999997,-2.6040000000000001E-2,1.093,null,-0.10750999999999999,1.1013390000000001,1.312E-3,null,0.46127000000000001,1.023752]
["SE0","SW",0,0.86043800000000004,0.99540600000000001,0.99849299999999996,1.0402180000000001,-0.25239,1.8428180000000001,-0.85223000000000004,0.110359,null,32.126100000000001,-4.6330000000000003E-2,1.3031999999999999,null,-0.56777999999999995,1.142153,4.2900000000000002E-4,null,0.48476799999999998,1.0248930000000001]
["SW0","SW",1,0.71339300000000005,1.0715330000000001,0.99606700000000004,1.1536789999999999,-0.28381000000000001,2.022713,-0.95377999999999996,0.101608,null,38.311700000000002,-2.6349999999999998E-2,1.1152,null,-2.11219,1.275528,-1.56E-3,null,0.52164500000000003,1.0241720000000001]
["SW1","SW",2,0.903528,0.975136,0.99901799999999996,0.84698099999999998,-0.24496999999999999,1.7830969999999999,-0.73024,4.0996999999999999E-2,null,29.8812,-5.5570000000000001E-2,1.3911,null,-0.58252000000000004,1.156757,-2.7E-4,null,0.41357699999999997,1.0283420000000001]
["SW2","SW",3,0.86268500000000004,0.99314800000000003,0.99877300000000002,1.1350180000000001,-0.25237999999999999,1.885321,-0.92144000000000004,0.150228,null,32.427799999999998,-5.0549999999999998E-2,1.3939999999999999,null,0.190577,1.069563,1.8220000000000001E-3,null,0.53676699999999999,1.0226999999999999]
["SW3"]
[]
[]
[]
["BC BEC tree taper volume and diameter-height coefficients ","BEC","Equation#","A0","A1","A2","A3","A4","A5","A6","A7","A8","A9","ER","Dhc0","Dhc1","Dhc2"]
["Species"]
[null,"BWBS",65,1.1466339999999999,1.01509,0.99917,50.551900000000003,-164.68299999999999,166.16900000000001,-51.160499999999999,-23.3535,-0.49339499999999997,1.56087E-3,7.1609999999999998E-3,38.704999999999998,-3.9E-2,1.276]
["Sw","BWBS",50,0.97450400000000004,1.07714,0.996946,169.16800000000001,-464.65,457.97399999999999,-161.678,-90.644499999999994,-0.422518,1.58735E-3,6.0780000000000001E-3,29.0075,-4.8590000000000001E-2,1.1781999999999999]
["Pl","BWBS",6,0.98428499999999997,1.0262,1.0006619999999999,244.333,-634.98,615.07100000000003,-223.24100000000001,-134.011,-0.57939399999999996,-1.7905E-3,9.7330000000000003E-3,33.889000000000003,-3.5000000000000003E-2,0.90700000000000003]
["At","BWBS",1,0.92647199999999996,1.0234000000000001,0.99968299999999999,121.36499999999999,-272.245,245.76900000000001,-93.776700000000005,-68.607799999999997,-0.50180499999999995,-6.2600000000000004E-4,8.9619999999999995E-3,35.256,3.5000000000000003E-2,1]
["Ac","BWBS",26,2.3320669999999999,0.84434799999999999,1.000894,44.702800000000003,-149.679,145.1,-38.989100000000001,-17.785599999999999,-0.64663700000000002,-1.7022999999999999E-3,1.2871E-2,19.030999999999999,0.109,1.167]
["Ep","BWBS",11,0.704739,1.2081900000000001,0.99280400000000002,29.736899999999999,-113.372,116.252,-31.699100000000001,-11.5688,-0.57979199999999997,1.73412E-3,6.1060000000000003E-3,18.600000000000001,8.4000000000000005E-2,1.5640000000000001]
["Bg","BWBS",43,1.5791740000000001,0.88147399999999998,1.0061720000000001,25.673500000000001,-82.210599999999999,76.425700000000006,-18.803899999999999,-9.5302000000000007,-0.76725399999999999,2.22098E-3,6.4580000000000002E-3,22.283000000000001,0.2,6.4779999999999998]
["Lt","BWBS",49,1.6752279999999999,0.91297399999999995,1.001646,78.621200000000002,-147.29499999999999,113.1747,-43.4938,-43.7179,-0.423541,-1.9911999999999998E-3,8.5699999999999995E-3,38.704999999999998,-3.9E-2,1.276]
["Pa","BWBS",31,1.25302,0.95604100000000003,0.99978,100.44799999999999,-248.13,230.785,-82.071600000000004,-53.966099999999997,-0.54423600000000005,-2.3286000000000001E-3,1.1528E-2,38.704999999999998,-3.9E-2,1.276]
["Fd","SBS",72,1.2319690000000001,0.99872899999999998,0.99897400000000003,64.890799999999999,-215.76400000000001,219.274,-67.506500000000003,-30.0137,-0.39923599999999998,-3.6190000000000001E-4,1.0111999999999999E-2,38.704999999999998,-3.9E-2,1.276]
["Sw","SBS",57,1.011506,1.0557099999999999,0.99678199999999995,93.935599999999994,-244.59299999999999,234.77799999999999,-83.350300000000004,-50.445300000000003,-0.35659999999999997,3.7251999999999999E-4,8.5039999999999994E-3,29.0075,-4.8590000000000001E-2,1.1781999999999999]
["Pl","SBS",9,1.144134,0.99334500000000003,0.99922500000000003,257.02199999999999,-704.73800000000006,696.00199999999995,-247.255,-138.822,-0.264349,-2.9968E-3,1.0204E-2,33.889000000000003,-3.5000000000000003E-2,0.90700000000000003]
["At","SBS",5,0.86666699999999997,1.04901,0.99911000000000005,121.991,-272.27199999999999,244.953,-93.554199999999994,-68.979699999999994,-0.51592700000000002,-4.639E-4,9.5790000000000007E-3,35.256,3.5000000000000003E-2,1]
["Ac","SBS",29,0.34004699999999999,1.5251999999999999,0.98271200000000003,131.07900000000001,-321.202,300.10500000000002,-108.547,-71.287999999999997,-0.92350900000000002,-1.9894999999999999E-3,2.1031000000000001E-2,19.030999999999999,0.109,1.167]
["Ep","SBS",18,1.226561,0.97819100000000003,0.99898100000000001,16.972100000000001,-48.983199999999997,42.582000000000001,-9.7146799999999995,-6.7913100000000002,-0.37961299999999998,6.6220999999999999E-4,1.2063000000000001E-2,18.600000000000001,8.4000000000000005E-2,1.5640000000000001]
["Bg","SBS",47,1.032756,1.00546,0.99812400000000001,8.79223,49.323099999999997,-81.721599999999995,24.397690000000001,-6.8216700000000001,-0.32812599999999997,7.3275E-4,1.231E-2,22.283000000000001,0.2,6.4779999999999998]
["Lt","SBS",49,1.6752279999999999,0.91297399999999995,1.001646,78.621200000000002,-147.29499999999999,113.1747,-43.4938,-43.7179,-0.423541,-1.9911999999999998E-3,8.5699999999999995E-3,38.704999999999998,-3.9E-2,1.276]
["Pa"]

{"sheet":"NLRYields","index":4,"n_rows":31,"n_cols":15,"rows_kept":31,"cut":false,"hidden":true,"merged":[[7,12,7,14]]}
[null,"Uses Excel Solver to fit a non-linear regression function; for more information see Usage Notes near cell V4"]
[]
[null,"Model:"]
[]
[null,"Model: y=a_*(x^b_)*EXP(-c_*x)"]
[]
[null,"Data","Scenario A (15:24 29 May 2012)"]
[null,"Age","St_TBa",null,null,null,null,null,null,null,null,null,"Yield Table"]
[null,"x","y",null,"Pred","Resid",null,"Equation coefficients",null,null,"known solution",null,{"$f":"B8","v":"Age"},{"$f":"C8","v":"St_TBa"},"MAI"]
[]
[null,15,25.339410800796163,null,{"$f":"a_*(X^b_)*EXP(-c_*X)","v":67.004430647817031},{"$f":"C11-E11","v":-41.665019847020872},null,"a_",258.99999955062293,null,1.0088657484052889E-2,null,10,{"$f":"a_*(M11^b_)*EXP(-c_*M11)","v":73.906240708506004},{"$f":"N11/M11","v":7.3906240708506008}]
[null,20,22.462106248744195,null,{"$f":"a_*(X^b_)*EXP(-c_*X)","v":66.039803388095507},{"$f":"C12-E12","v":-43.577697139351315},null,"b_",-0.70924833335701987,null,2.5837005731720257,null,20,66.039803388095507,{"$f":"N12/M12","v":3.3019901694047755}]
[null,25,20.037572226483672,null,{"$f":"a_*(X^b_)*EXP(-c_*X)","v":68.137680813622936},{"$f":"C13-E13","v":-48.10010858713926},null,"c_",-3.7907385206055001E-2,null,2.7691008779226551E-2,null,30,72.367408686998402,2.4122469562332802]
[null,30,19.398734157425114,null,{"$f":"a_*(X^b_)*EXP(-c_*X)","v":72.367408686998402},{"$f":"C14-E14","v":-52.968674529573292},null,null,null,null,null,null,40,86.210489950029313,2.1552622487507329]
[null,null,null,null,null,null,null,"SSerror",{"$f":"SUMPRODUCT((Y-Pred)^2)","v":8754.2904943361245},null,204843.88962333894,null,50,107.51189833328689,2.1502379666657379]
[null,null,null,null,null,null,null,"SStotal",{"$f":"(COUNT(Y)-1)*VAR(Y)","v":21.837685151968117},null,214771.80646655004,null,60,138.01524021255005,2.3002540035425008]
[null,null,null,null,null,null,null,null,null,null,null,null,70,180.74855285816264,2.5821221836880377]
[null,null,null,null,null,null,null,"approximate R2",{"$f":"1-(SSerror/SStotal)","v":-399.87996659971748},null,null,null,80,240.20045144058807,3.0025056430073507]
[null,null,null,null,null,null,null,"errorVariance",{"$f":"SSerror/(COUNT(Y)-3)","v":8754.2904943361245},null,null,null,90,322.79266703830837,3.5865851893145373]
[null,null,null,null,null,null,null,"stdErrorOfEstimate",{"$f":"SQRT(I19)","v":93.564365515596393},null,null,null,100,437.62277777113019,4.3762277777113017]
[null,null,null,null,null,null,null,null,null,null,null,null,110,597.54677616787751,5.4322434197079774]
[null,null,null,null,null,null,null,null,null,null,null,null,120,820.72963644440699,6.8394136370367251]
[null,null,null,null,null,null,null,null,null,null,null,null,130,1132.856321122023,8.7142793932463309]
[null,null,null,null,null,null,null,null,null,null,null,null,140,1570.2817432319046,11.216298165942176]
[null,null,null,null,null,null,null,null,null,null,null,null,150,2184.5193571229302,14.563462380819534]
[null,null,null,null,null,null,null,null,null,null,null,null,160,3048.6407757664747,19.054004848540465]
[null,null,null,null,null,null,null,null,null,null,null,null,170,4266.4059890569051,25.096505817981797]
[null,null,null,null,null,null,null,null,null,null,null,null,180,5985.2979848483828,33.251655471379905]
[null,null,null,null,null,null,null,null,null,null,null,null,190,8415.1435966873614,44.290229456249271]
[]
[null,null,null,null,null,null,null,null,null,null,"Max MAI",null,{"$f":"INDEX(M11:M29,MATCH(N31,N11:N29,0))","v":190},{"$f":"INDEX(N11:N29,MATCH(O31,O11:O29,0))","v":8415.1435966873614},{"$f":"MAX(O11:O29)","v":44.290229456249271}]

{"sheet":"UserWorkArea","index":5,"n_rows":0,"n_cols":0,"rows_kept":0,"cut":false,"hidden":false,"merged":[]}

{"sheet":"Crop Plans","index":6,"n_rows":11,"n_cols":13,"rows_kept":11,"cut":false,"hidden":false,"merged":[]}
["Crop Plans",null,"Distribution Example CP",null,"Saved: 1840 Mar 30 2021"]
[null,"Stand Age","Year","Event","Settings"]
[null,null,null,"Crop Plans","CropPlansID := Distribution Example CP","Notes := "]
[]
[null,null,null,"Notes"]
[null,null,null,"Crop Plan","CropPlanID := Distribution Example CP","Notes := "]
[null,null,null,"Options","Region := 1","SubRegion := 1","StandsWbkName := MGM Stands.xlsx","_MinDbh := 0","_topdib := 0","_StumpHt := 0","_VolumeLoss := 0","Default_Sindex := 19.0 19.3 21.1 15.7","SppUtilStr := 111111111111111111111111"]
[null,13,2004,"Establish","StandID := MED-1-5-M12-SW13-AW13","StandWT := 1","SourceIndex := 2","CMI := 6.5","StandParsListSILV := [AW_TendedAllTrees 1A 24.33 None None AW 4425 13 7.69 1.24 10.17 5.12 1.23,PerfSurveyAllTrees 1A 20.56 None None SW 975 13 2.03 0.42 3.59 1.34 0.45]"]
[null,13,2004,"Record","Sheet := Stand"]
[null,13,2004,"Grow","Schedule := 7 10 10 10 10 10 10 10 10 10 10 10 10 10 10 10 10 10 10"]
[null,200,2191,"End"]

{"sheet":"Record","index":7,"n_rows":155,"n_cols":76,"rows_kept":155,"cut":false,"hidden":false,"merged":[]}
["RECORD",155,"NOTE: This worksheet can be saved into the MGM Records workbook; if a special name is desired, append or change the name in cell C2 (keep it short and simple) before clicking the save button on the MGMToolbar."]
["Crop Plans Worksheet Name",null,"Distribution Example CP"]
["Record Date:",null,"12:52 18 Dec 2024"]
["MGM Version",null,"MGM21A Dist Beta VS39 (Rev 6426) 17:39 30 Mar 2024"]
[]
["Crop Plans",11,"Distribution Example CP",null,"Saved: 1840 Mar 30 2021"]
[null,"Stand Age","Year","Event","Settings"]
[null,null,null,"Crop Plans","CropPlansID := Distribution Example CP","Notes := "]
[]
[null,null,null,"Notes"]
[null,null,null,"Crop Plan","CropPlanID := Distribution Example CP","Notes := "]
[null,null,null,"Options","Region := 1","SubRegion := 1","StandsWbkName := MGM Stands.xlsx","_MinDbh := 0","_topdib := 0","_StumpHt := 0","_VolumeLoss := 0","Default_Sindex := 19.0 19.3 21.1 15.7","SppUtilStr := 111111111111111111111111"]
[null,13,2004,"Establish","StandID := MED-1-5-M12-SW13-AW13","StandWT := 1","SourceIndex := 2","CMI := 6.5","StandParsListSILV := [AW_TendedAllTrees 1A 24.33 None None AW 4425 13 7.69 1.24 10.17 5.12 1.23,PerfSurveyAllTrees 1A 20.56 None None SW 975 13 2.03 0.42 3.59 1.34 0.45]"]
[null,13,2004,"Record","Sheet := Stand"]
[null,13,2004,"Grow","Schedule := 7 10 10 10 10 10 10 10 10 10 10 10 10 10 10 10 10 10 10"]
[null,200,2191,"End"]
[]
[]
["Note"]
[]
["Crop Plan",1,"Distribution Example CP",null,null,"12:52 18 Dec 2024"]
[]
["Options event has been executed",null,null,"Options","Region := 1","SubRegion := 1","StandsWbkName := MGM Stands.xlsx","_MinDbh := 0","_topdib := 0","_StumpHt := 0","_VolumeLoss := 0","Default_Sindex := 19.0 19.3 21.1 15.7","SppUtilStr := 111111111111111111111111"]
[]
["STAND",100,"Distribution Example CP",null,null,"12:52 18 Dec 2024"]
["STAND","Stand ID","MED-1-5-M12-SW13-AW13","Stand WT",1,null,null,null," "]
[null,"DateRun","12:52 18 Dec 2024","Gap Area PC",0," ",null,null,null,null,null,null,null,null,null,null,null,null,null,null,null,null,null,null,null,null,"Temporary range: accumulated (summed) annual changes between Yield reports"]
[null,"standAge",13,"TopLight",-1,null,null,null,null," ",null,null,null,null,null,null,null,null,null,null,null,null,null,null,null,null,null,"stDenDead","stBaDead","stVolDead","StBaSurvGrowth","StVolSurvGrowth"]
[null,"Year",2004,"CMI",6.5,null,null,null,null,null,null,null,null,null,null,null,null,null,null,null,null,null,null,null,null,null,"All",0,0,0,0,0]
[null,"Region",1,null,null,null,null,null,null,null,null,null,null,null,null,null,null,null,null,null,null,null,null,null,null,null,"Con",0,0,0,0,0]
[null,"SubRegion",1," ",null,null,null,null,null,null,null,null,null,null,null,null,null,null,null,null,null,null,null,null,null,null,"Dec",0,0,0,0,0]
[null,"CropPlanID","Distribution Example CP"]
[null,"CropPlansID","Distribution Example CP"]
[]
["YearsToBH","Stand summary","Site","stAvD","stQMD","stmaxD","stAvDIncr","stAvH","stTopH","stTopHIncr","stmaxH","stAvAge","stAvBHAge","stBa","stDen","stNuDen","stTotDen","strelBa","strelDen","strelTotDen","stSF","stVol","stGrVol","stMatDen","stJuvDen","stAvJvHt","stTopD","stDenDead","stBaDead","stVolDead","stBaSurvGrowth","stVolSurvGrowth","stMAI","stMaxMAI","stBWood","stBBark","stBBranch","stBFoliage","stBTotal","stCC"]
[null,"All",null,4.2256333890991904,4.7227347127846109,7.6581521034240723,0,6.3528189427736734,10.044910430908203,0,10.044910430908203,-1,-1,9.3314576409297274,5326.875,73.125,5400,1,1,1,0.21567373980942248,33.312513683141582,33.312513683141582,2986.875,2413.125,4.0537443210102371,7.6581521034240723,0,0,0,0,0,2.5625010525493526,0,13771.155127332135,2760.6390265678183,3798.0191085725455,7186.2318940698042,27516.045156542303,100]
[null,"Con",null,1.1509388513863086,1.387228227102685,2.365408182144165,0,2.0030419021844863,2.6373444259166718,0,2.9337234497070313,-1,-1,0.13631136417957379,901.875,73.125,975,1.460772469047961E-2,0.16930658218936995,0.16930658218936995,1.6624048270907188,0.15153070345477454,0.15153070345477454,0,975,2.0030419021844863,2.0867828018963337,0,0,0,0,0,1.165620795805958E-2,0,104.3871418369698,33.38595345850969,36.266671571346052,66.891887283532171,240.9316541503577,100]
[null,"Dec",null,4.9031084567308429,5.1437250146563374,7.6581521034240723,0,7.3112443923950199,10.044910430908203,0,10.044910430908203,-1,-1,9.1951462767501546,4425,0,4425,0.98539227530952045,0.83069341781063011,0.83069341781063011,0.20561370613863569,33.160982979686807,33.160982979686807,2986.875,1438.125,5.4440510456378641,7.6581521034240723,0,0,0,0,0,2.550844844591293,0,13666.767985495168,2727.2530731093088,3761.7524370012006,7119.3400067862731,27275.113502391941,100]
[6.6626606260392744,"Sw",20.559999465942383,1.1509388513863086,1.387228227102685,2.365408182144165,0,2.0030419021844863,2.6373444259166718,0,2.9337234497070313,-1,-1,0.13631136417957379,901.875,73.125,975,1.460772469047961E-2,0.16930658218936995,0.18055555555555555,1.6624048270907188,0.15153070345477454,0.15153070345477454,0,975,2.0030419021844863,2.0867828018963337,0,0,0,0,0,1.165620795805958E-2,0,104.3871418369698,33.38595345850969,36.266671571346052,66.891887283532171,240.9316541503577,100]
[8,"Pl",19.299999237060547,0,0,0,0,0,0,0,0,0,0,0,0,0,0,0,0,0,1,0,0,0,0,0,0,0,0,0,0,0,0,0,0,0,0,0,0,0]
[1.9566470267008254,"Aw",24.329999923706055,4.9031084567308429,5.1437250146563374,7.6581521034240723,0,7.3112443923950199,10.044910430908203,0,10.044910430908203,-1,-1,9.1951462767501546,4425,0,4425,0.98539227530952045,0.83069341781063011,0.81944444444444442,0.20561370613863569,33.160982979686807,33.160982979686807,2986.875,1438.125,5.4440510456378641,7.6581521034240723,0,0,0,0,0,2.550844844591293,0,13666.767985495168,2727.2530731093088,3761.7524370012006,7119.3400067862731,27275.113502391941,100]
[15,"Sb",15.699999809265137,0,0,0,0,0,0,0,0,0,0,0,0,0,0,0,0,0,1,0,0,0,0,0,0,0,0,0,0,0,0,0,0,0,0,0,0,0]
[]
[]
["trNum","trSpp","trDbh","trPha","trHt","trAge","trBHAge","trCratio","trCwidth","x","y","trDbhIncr","trHtIncr","trPsurv","trSppIdx","trMGMSppIdx","trBWood","trBBark","trBBranch","trBFoliage","trBTotal","HIDIratio","Hdratio","trBaHa","stBagt","stCbagt","stDbagt","trSppgrp","trMGMspp","PctRank","trVol","trUtil","trVRF","trJuv","trSWGGR","trPLGGR","trDECDBHGR","trSWDBHGR","trPLDBHGR","trSBDBHGR","trVolSurvGrth","trChar01","trChar02","trChar03","trChar04","trChar05","trChar06","trChar07","trChar08","trChar09","trChar10","trChar11","trChar12","trChar13","trChar14","trChar15","trChar16","trChar17","trChar18","trChar19","tmpKey"]
[34,"AW",7.6581521034240723,110.625,10.044910430908203,-1,-1,0.4555775532600293,1.6598662977218628,94,4,-1,-1,-1,3,3,7.97673145651083,1.4712725194858676,1.9340637020535956,2.9334167225640662,14.315484400614359,-1,1.3116624343902723,0.509555086131386,0,0,0,"Dec","Aw",1,2.0428157353480286E-2,true,1,false,0,0,0,0,0,0,0,-1,-1,-1,-1,-1,-1,-1,-1,-1,-1,-1,-1,-1,-1,-1,-1,-1,-1,-1,34]
[3,"AW",7.1438322067260742,110.625,9.2780771255493164,-1,-1,0.46999107778635679,1.6115202274322509,99,64,-1,-1,-1,3,3,6.6972927290018776,1.2588495269195352,1.6732164210205671,2.6587173378526963,12.288076014794676,-1,1.2987535061103204,0.44341017609237199,0.509555086131386,0,0.509555086131386,"Dec","Aw",0.98699999999999999,1.6446291519246699E-2,true,1,false,0,0,847.18307644128799,0,0,0,0,-1,-1,-1,-1,-1,-1,-1,-1,-1,-1,-1,-1,-1,-1,-1,-1,-1,-1,-1,3]
[25,"AW",6.9954438209533691,110.625,8.4366264343261719,-1,-1,0.50947917418336963,1.5975717191696166,95,80,-1,-1,-1,3,3,6.3529486728803075,1.2009574126622755,1.6016047337565305,2.5809491507241793,11.736459970023294,-1,1.2060173235979748,0.42518086533875471,0.95296526222375799,0,0.95296526222375799,"Dec","Aw",0.97399999999999998,1.4336824498232679E-2,true,1,false,0,0,1637.46951431036,0,0,0,0,-1,-1,-1,-1,-1,-1,-1,-1,-1,-1,-1,-1,-1,-1,-1,-1,-1,-1,-1,25]
[17,"AW",6.8647212982177734,110.625,7.8351740837097168,-1,-1,0.54157493934192613,1.5852838020324707,79,42,-1,-1,-1,3,3,6.0586241366876825,1.1512057643359459,1.5398672339896458,2.5130028949830554,11.26270002999633,-1,1.1413681260073725,0.40943878988542909,1.3781461275625126,0,1.3781461275625126,"Dec","Aw",0.96199999999999997,1.2820206565731724E-2,true,1,false,0,0,2411.3404870033264,0,0,0,0,-1,-1,-1,-1,-1,-1,-1,-1,-1,-1,-1,-1,-1,-1,-1,-1,-1,-1,-1,17]
[38,"AW",6.7479410171508789,110.625,8.6355304718017578,-1,-1,0.48569205894478168,1.5743064556121826,37,68,-1,-1,-1,3,3,5.8027704580186423,1.1077447230072079,1.4857810733344519,2.4527548637862706,10.849051118146573,-1,1.2797282089237731,0.39562681587413345,1.7875849174479417,0,1.7875849174479417,"Dec","Aw",0.94899999999999995,1.3674346776724144E-2,true,1,false,0,0,3170.7502806186676,0,0,0,0,-1,-1,-1,-1,-1,-1,-1,-1,-1,-1,-1,-1,-1,-1,-1,-1,-1,-1,-1,38]
[40,"AW",6.7131624221801758,110.625,8.9317817687988281,-1,-1,0.46794382431568654,1.5710372676849365,18,94,-1,-1,-1,3,3,5.7278560565709364,1.0949804027223204,1.4698678607670543,2.434895250322473,10.727599570382784,-1,1.3304879588922758,0.39155923815785365,2.1832117333220751,0,2.1832117333220751,"Dec","Aw",0.93600000000000005,1.400482927595206E-2,true,1,false,0,0,3917.2412556409836,0,0,0,0,-1,-1,-1,-1,-1,-1,-1,-1,-1,-1,-1,-1,-1,-1,-1,-1,-1,-1,-1,40]
[14,"AW",6.7076330184936523,110.625,9.1409540176391602,-1,-1,0.45698127483936762,1.5705175037384034,74,97,-1,-1,-1,3,3,5.7159995032302975,1.0929585707634542,1.4673460504926636,2.4320592985038774,10.708363422990292,-1,1.362768951795154,0.39091447573331678,2.5747709714799285,0,2.5747709714799285,"Dec","Aw",0.92400000000000004,1.4312600920658013E-2,true,1,false,0,0,4659.8848485946655,0,0,0,0,-1,-1,-1,-1,-1,-1,-1,-1,-1,-1,-1,-1,-1,-1,-1,-1,-1,-1,-1,14]
[15,"AW",6.4919900894165039,110.625,8.9182777404785156,-1,-1,0.45820781384079817,1.5502470684051513,24,44,-1,-1,-1,3,3,5.2650797501022897,1.0157193041513062,1.3707523329802067,2.3222191281245697,9.9737705153583729,-1,1.3737355753234191,0.3661835759165411,2.9656854472132452,0,2.9656854472132452,"Dec","Aw",0.91100000000000003,1.3091243515895745E-2,true,1,false,0,0,5401.9167512655258,0,0,0,0,-1,-1,-1,-1,-1,-1,-1,-1,-1,-1,-1,-1,-1,-1,-1,-1,-1,-1,-1,15]
[29,"AW",6.4706954956054688,110.625,8.5370693206787109,-1,-1,0.47761707187580937,1.548245376586914,6,70,-1,-1,-1,3,3,5.221758294930102,1.008261874261031,1.3613992511700943,2.3114534629709569,9.9028728833321846,-1,1.3193433884312138,0.36378525379840049,3.3318690231297863,0,3.3318690231297863,"Dec","Aw",0.89800000000000002,1.2445931936658383E-2,true,1,false,0,0,6120.0931549072266,0,0,0,0,-1,-1,-1,-1,-1,-1,-1,-1,-1,-1,-1,-1,-1,-1,-1,-1,-1,-1,-1,29]
[21,"AW",6.3573064804077148,110.625,9.006622314453125,-1,-1,0.44740907039575883,1.5375868091583251,91,55,-1,-1,-1,3,3,4.9946995235452532,0.96906470588001381,1.3121567259804157,2.2543763610441032,9.5302973164497864,-1,1.4167355848282936,0.35114740466416694,3.6956542769281868,0,3.6956542769281868,"Dec","Aw",0.88600000000000001,1.2687453334491698E-2,true,1,false,0,0,6835.9138441085815,0,0,0,0,-1,-1,-1,-1,-1,-1,-1,-1,-1,-1,-1,-1,-1,-1,-1,-1,-1,-1,-1,21]
[8,"AW",6.3411870002746582,110.625,8.7958545684814453,-1,-1,0.45735703162354641,1.5360715780258178,46,90,-1,-1,-1,3,3,4.9629132946460039,0.96356225928040351,1.3052329451792832,2.2462962456858375,9.4780047447915283,-1,1.3870990664839986,0.34936893526604973,4.0468016815923535,0,4.0468016815923535,"Dec","Aw",0.873,1.2326205042367951E-2,true,1,false,0,0,7539.190873503685,0,0,0,0,-1,-1,-1,-1,-1,-1,-1,-1,-1,-1,-1,-1,-1,-1,-1,-1,-1,-1,-1,8]
[9,"AW",6.2351236343383789,110.625,8.0427370071411133,-1,-1,0.49461979231586883,1.5261016216278076,2,70,-1,-1,-1,3,3,4.756804196910875,0.92778946528729722,1.2601505578548493,2.1933431820491465,9.1380874021021672,-1,1.2899081844741229,0.33777951194624561,4.3961706168584032,0,4.3961706168584032,"Dec","Aw",0.86,1.0893738081377356E-2,true,1,false,0,0,8240.6846854090691,0,0,0,0,-1,-1,-1,-1,-1,-1,-1,-1,-1,-1,-1,-1,-1,-1,-1,-1,-1,-1,-1,9]
[22,"AW",5.8988504409790039,110.625,8.4706869125366211,-1,-1,0.4528607843125963,1.4944919414520264,34,56,-1,-1,-1,3,3,4.1377773950446395,0.81930498852563149,1.1226566417065078,2.0279326165071665,8.1076716417839449,-1,1.4359894351094586,0.302327696818671,4.7339501288046488,0,4.7339501288046488,"Dec","Aw",0.84799999999999998,1.0291386233165847E-2,true,1,false,0,0,8930.4452374577522,0,0,0,0,-1,-1,-1,-1,-1,-1,-1,-1,-1,-1,-1,-1,-1,-1,-1,-1,-1,-1,-1,22]
[28,"AW",5.7001495361328125,110.625,8.455958366394043,-1,-1,0.44370787308037568,1.4758140563964843,24,38,-1,-1,-1,3,3,3.7961689213532086,0.75869757974240193,1.0452884464428338,1.932000032106312,7.5321549796447567,-1,1.4834625500247614,0.28230311028996741,5.03627782562332,0,5.03627782562332,"Dec","Aw",0.83499999999999996,9.6025087487625754E-3,true,1,false,0,0,9583.0055674910545,0,0,0,0,-1,-1,-1,-1,-1,-1,-1,-1,-1,-1,-1,-1,-1,-1,-1,-1,-1,-1,-1,28]
[35,"AW",5.6640329360961914,110.625,9.0943470001220703,-1,-1,0.41087995323935417,1.4724190959930419,45,84,-1,-1,-1,3,3,3.7359732080173376,0.74795801532088213,1.0315340975069165,1.9147099052574492,7.4301752261025857,-1,1.6056310234647304,0.2787370537612785,5.3185809359132872,0,5.3185809359132872,"Dec","Aw",0.82199999999999995,1.0204799151309127E-2,true,1,false,0,0,10213.584609925747,0,0,0,0,-1,-1,-1,-1,-1,-1,-1,-1,-1,-1,-1,-1,-1,-1,-1,-1,-1,-1,-1,35]
[26,"AW",5.5639324188232422,110.625,8.3900108337402344,-1,-1,0.44032001000711202,1.4630096473693848,74,20,-1,-1,-1,3,3,3.5721534595294488,0.71863501459943868,0.99390763181344044,1.8670276621149144,7.1517237680572423,-1,1.5079282425063496,0.26897186706713977,5.5973179896745657,0,5.5973179896745657,"Dec","Aw",0.81,9.0833963030678509E-3,true,1,false,0,0,10840.168253481388,0,0,0,0,-1,-1,-1,-1,-1,-1,-1,-1,-1,-1,-1,-1,-1,-1,-1,-1,-1,-1,-1,26]
[16,"AW",5.4512443542480469,110.625,9.2529382705688477,-1,-1,0.39409476191939963,1.4524169692993163,32,33,-1,-1,-1,3,3,3.3930010170222626,0.68640039372900452,0.95241906596171011,1.8137733021267226,6.8455937788396994,-1,1.6973992852399318,0.25818705563250349,5.8662898567417052,0,5.8662898567417052,"Dec","Aw",0.79700000000000004,9.6287423719224798E-3,true,1,false,0,0,11455.678277313709,0,0,0,0,-1,-1,-1,-1,-1,-1,-1,-1,-1,-1,-1,-1,-1,-1,-1,-1,-1,-1,-1,16]
[2,"AW",5.4346170425415039,110.625,8.2744579315185547,-1,-1,0.43984580051442818,1.4508540019989014,44,18,-1,-1,-1,3,3,3.3670357567504552,0.68171344692723446,0.94637522675793606,1.8059538508624833,6.8010782812981088,-1,1.5225466425227629,0.25661442039000748,6.1244769123742087,0,6.1244769123742087,"Dec","Aw",0.78400000000000003,8.5514206044482975E-3,true,1,false,0,0,12058.722184002399,0,0,0,0,-1,-1,-1,-1,-1,-1,-1,-1,-1,-1,-1,-1,-1,-1,-1,-1,-1,-1,-1,2]
[6,"AW",5.4014716148376465,110.625,7.5613417625427246,-1,-1,0.47946940302534569,1.4477383317947388,39,77,-1,-1,-1,3,3,3.3156337549176635,0.67242339623022862,0.93438693499752168,1.7903958718256798,6.7128399579710933,-1,1.399866981022726,0.25349381149433914,6.3810913327642158,0,6.3810913327642158,"Dec","Aw",0.77200000000000002,7.7148691523815831E-3,true,1,false,0,0,12659.926694333553,0,0,0,0,-1,-1,-1,-1,-1,-1,-1,-1,-1,-1,-1,-1,-1,-1,-1,-1,-1,-1,-1,6]
[19,"AW",5.058652400970459,110.625,7.0105991363525391,-1,-1,0.49638027714960825,1.4155133256912231,87,88,-1,-1,-1,3,3,2.8116081091974054,0.58045849293490404,0.81504764276494557,1.6318253644501222,5.8389396093473769,-1,1.3858629889271727,0.22233756340664446,6.6345851442585548,0,6.6345851442585548,"Dec","Aw",0.75900000000000001,6.2811981995431069E-3,true,1,false,0,0,13257.464491724968,0,0,0,0,-1,-1,-1,-1,-1,-1,-1,-1,-1,-1,-1,-1,-1,-1,-1,-1,-1,-1,-1,19]
[1,"AW",4.9664602279663086,110.625,7.3286762237548828,-1,-1,0.46949055217276736,1.406847261428833,71,92,-1,-1,-1,3,3,2.6845263690440708,0.55699995712839545,0.78439905159840018,1.5899242216131275,5.6158495993839939,-1,1.4756337285229537,0.2143073612767718,6.8569227076651993,0,6.8569227076651993,"Dec","Aw",0.746,6.3346373754643564E-3,true,1,false,0,0,13817.077913582325,0,0,0,0,-1,-1,-1,-1,-1,-1,-1,-1,-1,-1,-1,-1,-1,-1,-1,-1,-1,-1,-1,1]
[18,"AW",4.6152386665344238,110.625,7.0674448013305664,-1,-1,0.46569854823868045,1.3738324346542359,61,57,-1,-1,-1,3,3,2.2323765122836932,0.47251165178299342,0.67322310928587148,1.4332667113956883,4.8113779847482467,-1,1.5313281309972862,0.18506806921053415,7.0712300689419711,0,7.0712300689419711,"Dec","Aw",0.73399999999999999,5.2840279349028966E-3,true,1,false,0,0,14366.492576301098,0,0,0,0,-1,-1,-1,-1,-1,-1,-1,-1,-1,-1,-1,-1,-1,-1,-1,-1,-1,-1,-1,18]
[27,"AW",4.5574502944946289,110.625,7.2640509605407715,-1,-1,0.44970518139465504,1.368400327682495,90,27,-1,-1,-1,3,3,2.1627506113226569,0.45934487129599083,0.65577589411274939,1.4079513487142354,4.6858227254456324,-1,1.5938848459446062,0.18046253203410242,7.2562981381525056,0,7.2562981381525056,"Dec","Aw",0.72099999999999997,5.2987279259029043E-3,true,1,false,0,0,14877.053353786469,0,0,0,0,-1,-1,-1,-1,-1,-1,-1,-1,-1,-1,-1,-1,-1,-1,-1,-1,-1,-1,-1,27]
[30,"AW",4.2299394607543945,110.625,6.463554859161377,-1,-1,0.48379146569901821,1.337614309310913,15,19,-1,-1,-1,3,3,1.792919829401127,0.38859418710956034,0.56138723692152959,1.267014538277401,4.0099157917096182,-1,1.5280490227178394,0.15545742458022133,7.436760670186608,0,7.436760670186608,"Dec","Aw",0.70799999999999996,4.0653681434868628E-3,true,1,false,0,0,15381.221292614937,0,0,0,0,-1,-1,-1,-1,-1,-1,-1,-1,-1,-1,-1,-1,-1,-1,-1,-1,-1,-1,-1,30]
[33,"AW",4.2253751754760742,110.625,6.9706506729125977,-1,-1,0.44831745899684294,1.337185266494751,38,71,-1,-1,-1,3,3,1.7880587726529129,0.38765434793711961,0.56012563017657868,1.2650813922452668,4.0009201430118777,-1,1.649711654806419,0.15512211518748564,7.592218094766829,0,7.592218094766829,"Dec","Aw",0.69599999999999995,4.377553518172466E-3,true,1,false,0,0,15849.158345460892,0,0,0,0,-1,-1,-1,-1,-1,-1,-1,-1,-1,-1,-1,-1,-1,-1,-1,-1,-1,-1,-1,33]
[7,"AW",4.1970982551574707,110.625,6.8570346832275391,-1,-1,0.45398533342730946,1.3345272359848022,67,12,-1,-1,-1,3,3,1.7581202333187704,0.38185989479743609,0.55234255049374725,1.2531243550989901,3.9454470337089438,-1,1.6337560539121261,0.15305285585412304,7.7473402099543147,0,7.7473402099543147,"Dec","Aw",0.68300000000000005,4.2489249444204232E-3,true,1,false,0,0,16316.590474247932,0,0,0,0,-1,-1,-1,-1,-1,-1,-1,-1,-1,-1,-1,-1,-1,-1,-1,-1,-1,-1,-1,7]
[39,"AW",4.1744723320007324,110.625,7.6117444038391113,-1,-1,0.40770325188774525,1.3324003992080689,62,2,-1,-1,-1,3,3,1.7343837255558849,0.37725823638106798,0.54615566525671078,1.2435808674073128,3.9013784946009764,-1,1.8234027676956648,0.15140713407570072,7.900393065808438,0,7.900393065808438,"Dec","Aw",0.67,4.6699790693509723E-3,true,1,false,0,0,16780.894468724728,0,0,0,0,-1,-1,-1,-1,-1,-1,-1,-1,-1,-1,-1,-1,-1,-1,-1,-1,-1,-1,-1,39]
[20,"AW",3.9788844585418701,110.625,6.5015144348144531,-1,-1,0.46447250295579284,1.3140151391029358,96,60,-1,-1,-1,3,3,1.5372276609010307,0.33876311168275453,0.49418257424328149,1.1619826769292547,3.5321560237563214,-1,1.6340043302481428,0.13755165530223679,8.0518001998841395,0,8.0518001998841395,"Dec","Aw",0.65800000000000003,3.6237846453440071E-3,true,1,true,0,0,17242.695470452309,0,0,0,0,-1,-1,-1,-1,-1,-1,-1,-1,-1,-1,-1,-1,-1,-1,-1,-1,-1,-1,-1,20]
[31,"AW",3.973494291305542,110.625,6.3827567100524902,-1,-1,0.4727535066922614,1.313508463382721,86,44,-1,-1,-1,3,3,1.5319962409641674,0.33773466637481742,0.49278849885394554,1.1597570099438277,3.5222764161367581,-1,1.6063334289969131,0.13717922718535658,8.1893518551863771,0,8.1893518551863771,"Dec","Aw",0.64500000000000002,3.5475733460314596E-3,true,1,true,0,0,17682.859563678503,0,0,0,0,-1,-1,-1,-1,-1,-1,-1,-1,-1,-1,-1,-1,-1,-1,-1,-1,-1,-1,-1,31]
[32,"AW",3.732879638671875,110.625,6.2928891181945801,-1,-1,0.46314929103019298,1.2908906860351561,98,95,-1,-1,-1,3,3,1.3092946492394675,0.29358163794118408,0.43264058815288753,1.0616931568227563,3.0972100321562954,-1,1.6858001669814175,0.1210684936720104,8.3265310823717336,0,8.3265310823717336,"Dec","Aw",0.63200000000000001,3.0910254787400553E-3,true,1,true,0,0,18122.427369654179,0,0,0,0,-1,-1,-1,-1,-1,-1,-1,-1,-1,-1,-1,-1,-1,-1,-1,-1,-1,-1,-1,32]
[13,"AW",3.7247381210327148,110.625,6.2015037536621094,-1,-1,0.46941230153862729,1.2901253833770752,63,38,-1,-1,-1,3,3,1.3021255059072019,0.29214743290474848,0.43067654102705222,1.0584197076770026,3.0833691875160052,-1,1.6649502735893524,0.12054096186144876,8.4475995760437446,0,8.4475995760437446,"Dec","Aw",0.62,3.0326872398293127E-3,true,1,true,0,0,18535.377179682255,0,0,0,0,-1,-1,-1,-1,-1,-1,-1,-1,-1,-1,-1,-1,-1,-1,-1,-1,-1,-1,-1,13]
[36,"AW",3.4656085968017578,110.625,5.903712272644043,-1,-1,0.47428775251149891,1.2657672080993652,14,54,-1,-1,-1,3,3,1.0861802919172003,0.24852088921575519,0.37058797370277224,0.95580076008191872,2.6610899149176466,-1,1.7035138584583074,0.10435233938658753,8.5681405379051938,0,8.5681405379051938,"Dec","Aw",0.60699999999999998,2.5024791431871654E-3,true,1,true,0,0,18947.426334321499,0,0,0,0,-1,-1,-1,-1,-1,-1,-1,-1,-1,-1,-1,-1,-1,-1,-1,-1,-1,-1,-1,36]
[5,"AW",3.3505370616912842,110.625,4.8762636184692383,-1,-1,0.56410268042491063,1.2549504837989807,75,8,-1,-1,-1,3,3,0.99775434251182538,0.23039368833849683,0.34540669299539339,0.91122691771085973,2.4847816415565753,-1,1.4553677600592778,9.7537589289906565E-2,8.6724928772917806,0,8.6724928772917806,"Dec","Aw",0.59399999999999997,1.9305412946499412E-3,true,1,true,0,0,19330.809285342693,0,0,0,0,-1,-1,-1,-1,-1,-1,-1,-1,-1,-1,-1,-1,-1,-1,-1,-1,-1,-1,-1,5]
[10,"AW",3.256486177444458,110.625,5.9556441307067871,-1,-1,0.45509079410910191,1.246109700679779,14,85,-1,-1,-1,3,3,0.92881429450585873,0.21614077243080598,0.32550895082698933,0.87526277084411763,2.3457267886077715,-1,1.828855952762098,9.2138607253319044E-2,8.7700304665816873,0,8.7700304665816873,"Dec","Aw",0.58199999999999996,2.2321522211086594E-3,true,1,true,0,0,19701.462447792292,0,0,0,0,-1,-1,-1,-1,-1,-1,-1,-1,-1,-1,-1,-1,-1,-1,-1,-1,-1,-1,-1,10]
[4,"AW",2.9797742366790771,110.625,4.9693741798400879,-1,-1,0.52149554093555062,1.2200987782478332,63,16,-1,-1,-1,3,3,0.74292894090673911,0.1771076379408538,0.2705175850050543,0.77195988842181262,1.9625140522744597,-1,1.6677015723776429,7.7145373649323487E-2,8.8621690738350072,0,8.8621690738350072,"Dec","Aw",0.56899999999999995,1.5603257397001141E-3,true,1,true,0,0,20061.711231172085,0,0,0,0,-1,-1,-1,-1,-1,-1,-1,-1,-1,-1,-1,-1,-1,-1,-1,-1,-1,-1,-1,4]
[11,"AW",2.9501097202301025,110.625,4.8351788520812988,-1,-1,0.53333170287937881,1.2173103137016297,42,92,-1,-1,-1,3,3,0.72447002534913918,0.17317749726543316,0.26493574393457081,0.76111333164643113,1.9236965981955743,-1,1.6389827194983666,7.5617010234685214E-2,8.93931444748433,0,8.93931444748433,"Dec","Aw",0.55600000000000005,1.4881194066789318E-3,true,1,true,0,0,20391.348756104708,0,0,0,0,-1,-1,-1,-1,-1,-1,-1,-1,-1,-1,-1,-1,-1,-1,-1,-1,-1,-1,-1,11]
[24,"AW",2.8128633499145508,110.625,4.6932821273803711,-1,-1,0.53687943218720002,1.2044091548919678,29,48,-1,-1,-1,3,3,0.64267654480423497,0.15562770141399815,0.23989745201451182,0.71152165305879489,1.7497233512915398,-1,1.6685069779600006,6.8744891999489827E-2,9.0149314577190154,0,9.0149314577190154,"Dec","Aw",0.54400000000000004,1.3141836308025194E-3,true,1,true,0,0,20717.704643905163,0,0,0,0,-1,-1,-1,-1,-1,-1,-1,-1,-1,-1,-1,-1,-1,-1,-1,-1,-1,-1,-1,24]
[23,"AW",2.6797513961791992,110.625,5.9094586372375488,-1,-1,0.41669368215207897,1.1918966312408448,3,53,-1,-1,-1,3,3,0.56891532543048251,0.13959330767707831,0.21684576095605584,0.66437191771529391,1.5897263117789107,-1,2.2052264421480587,6.2392469703471752E-2,9.0836763497185053,0,9.0836763497185053,"Dec","Aw",0.53100000000000003,1.50550990568262E-3,true,1,true,0,0,21028.87765198946,0,0,0,0,-1,-1,-1,-1,-1,-1,-1,-1,-1,-1,-1,-1,-1,-1,-1,-1,-1,-1,-1,23]
[73,"SW",2.365408182144165,24.375,2.9337234497070313,-1,-1,0.79317946236124992,1.1623483691215515,1,22,-1,-1,-1,1,1,0.42442264036111893,0.11155764959191654,0.12376535564355035,0.18937862066046901,0.84912426625705484,-1,1.2402609713845274,1.0711411285504433E-2,9.146068819421977,0,9.146068819421977,"Con","Sw",0.51800000000000002,6.2150703746303114E-4,true,1,true,0,0,21325.325150191784,0,0,0,0,-1,-1,-1,-1,-1,-1,-1,-1,-1,-1,-1,-1,-1,-1,-1,-1,-1,-1,-1,73]
[62,"SW",2.1107954978942871,24.375,2.7811059951782227,-1,-1,0.79719042972938148,1.1384147768020629,29,31,-1,-1,-1,1,1,0.31767812062229323,8.802135862068515E-2,9.7121130580583942E-2,0.1557499886562079,0.65857059847977018,-1,1.3175629746949109,8.529563841786934E-3,9.156780230707481,1.0711411285504433E-2,9.146068819421977,"Con","Sw",0.50600000000000001,4.7235094539692878E-4,true,1,true,1.0711411285504433E-2,0,21325.325150191784,57.656824439764023,0,0,0,-1,-1,-1,-1,-1,-1,-1,-1,-1,-1,-1,-1,-1,-1,-1,-1,-1,-1,-1,62]
[72,"SW",2.0001685619354248,24.375,2.4694890975952148,-1,-1,0.8784298155220972,1.12801584482193,31,100,-1,-1,-1,1,1,0.27702356387074872,7.8694107157305015E-2,8.6605536231432537E-2,0.14200206730937867,0.58432527456886496,-1,1.2346404921021561,7.6589229328058233E-3,9.1653097945492679,1.9240975127291365E-2,9.146068819421977,"Con","Sw",0.49299999999999999,3.7745787077943092E-4,true,1,true,1.9240975127291365E-2,0,21325.325150191784,109.10746470093727,0,0,0,-1,-1,-1,-1,-1,-1,-1,-1,-1,-1,-1,-1,-1,-1,-1,-1,-1,-1,-1,72]
[44,"SW",1.8968552350997925,24.375,2.3937368392944336,-1,-1,0.88756960711910926,1.1183043920993805,8,37,-1,-1,-1,1,1,0.24206342415075355,7.0472337709924643E-2,7.7360018548686862E-2,0.12964543614616023,0.51954121655552532,-1,1.2619501978855547,6.8881545166782571E-3,9.1729687174820729,2.689989806009719E-2,9.146068819421977,"Con","Sw",0.48099999999999998,3.300682898118807E-4,true,1,true,2.689989806009719E-2,0,21325.325150191784,157.86157339811325,0,0,0,-1,-1,-1,-1,-1,-1,-1,-1,-1,-1,-1,-1,-1,-1,-1,-1,-1,-1,-1,44]
[50,"SW",1.8323441743850708,24.375,2.3577370643615723,-1,-1,0.88928721259507282,1.1122403523921967,69,79,-1,-1,-1,1,1,0.2216688392669382,6.5577025972738776E-2,7.1866798973168625E-2,0.12216917801826101,0.48128184223110659,-1,1.2867326440748075,6.4275965540104658E-3,9.1798568719987514,3.3788052576775446E-2,9.146068819421977,"Con","Sw",0.46800000000000003,3.0398753683407375E-4,true,1,true,3.3788052576775446E-2,0,21325.325150191784,204.09741975367069,0,0,0,-1,-1,-1,-1,-1,-1,-1,-1,-1,-1,-1,-1,-1,-1,-1,-1,-1,-1,-1,50]
[12,"AW",1.79301917552948,110.625,3.9462757110595703,-1,-1,0.52700105888734483,1.1085438024997711,80,24,-1,-1,-1,3,3,0.20711350245608132,5.6683554969170415E-2,9.3862137534982584E-2,0.3763590639833439,0.73401825894357819,-1,2.2009110470858362,2.7932707485626145E-2,9.1862844685527616,4.0215649130785909E-2,9.146068819421977,"Dec","Aw",0.45500000000000002,4.5218479314853644E-4,true,1,true,4.0215649130785909E-2,0,21325.325150191784,248.76080900430679,0,0,0,-1,-1,-1,-1,-1,-1,-1,-1,-1,-1,-1,-1,-1,-1,-1,-1,-1,-1,-1,12]
[74,"SW",1.7613897323608398,24.375,2.5952267646789551,-1,-1,0.79607853487521529,1.105570634841919,93,52,-1,-1,-1,1,1,0.2004823499326632,6.0403819433665802E-2,6.6072038899308905E-2,0.1141613853002604,0.4411195935658983,-1,1.4733972368514379,5.939439002351536E-3,9.2142171760383871,4.0215649130785909E-2,9.1740015269076025,"Con","Sw",0.443,3.1024079856633511E-4,true,1,true,4.0215649130785909E-2,0,21523.677896484733,248.76080900430679,0,0,0,-1,-1,-1,-1,-1,-1,-1,-1,-1,-1,-1,-1,-1,-1,-1,-1,-1,-1,-1,74]
[59,"SW",1.6149474382400513,24.375,2.2003684043884277,-1,-1,0.91012139614573928,1.0918050591945647,68,95,-1,-1,-1,1,1,0.16076300337735849,5.0422933711875603E-2,5.4925239470504532E-2,9.8357717601261718E-2,0.36446889416100037,-1,1.3625015602900121,4.9928818541762924E-3,9.2201566150407395,4.6155088133137442E-2,9.1740015269076025,"Con","Sw",0.43,2.2197966422307999E-4,true,1,true,4.6155088133137442E-2,0,21523.677896484733,291.69468373060226,0,0,0,-1,-1,-1,-1,-1,-1,-1,-1,-1,-1,-1,-1,-1,-1,-1,-1,-1,-1,-1,59]
[78,"SW",1.6131491661071777,24.375,2.3783857822418213,-1,-1,0.84167316347788679,1.0916360216140746,17,78,-1,-1,-1,1,1,0.16030804079957842,5.0306179322005644E-2,5.479512953777986E-2,9.8169785379465954E-2,0.36357913503882988,-1,1.4743743679831536,4.9817687229413285E-3,9.2251494968949164,5.1147969987313732E-2,9.1740015269076025,"Con","Sw",0.41699999999999998,2.3959168646776549E-4,true,1,true,5.1147969987313732E-2,0,21523.677896484733,331.05902753770351,0,0,0,-1,-1,-1,-1,-1,-1,-1,-1,-1,-1,-1,-1,-1,-1,-1,-1,-1,-1,-1,78]
[79,"SW",1.5997865200042725,24.375,2.1187574863433838,-1,-1,0.94207833686297959,1.0903799328804016,2,43,-1,-1,-1,1,1,0.15695176470165512,4.9443000259895328E-2,5.3833428539819803E-2,9.6777997760263509E-2,0.35700619126163374,-1,1.3244001370493641,4.8995768258335319E-3,9.2301312656178585,5.6129738710255062E-2,9.1740015269076025,"Con","Sw",0.40500000000000003,2.0979961820446352E-4,true,1,true,5.6129738710255062E-2,0,21523.677896484733,370.37953846156597,0,0,0,-1,-1,-1,-1,-1,-1,-1,-1,-1,-1,-1,-1,-1,-1,-1,-1,-1,-1,-1,79]
[48,"SW",1.58141028881073,24.375,2.1633386611938477,-1,-1,0.91898476261284656,1.0886525671482086,29,70,-1,-1,-1,1,1,0.15240641834385876,4.8268628642842995E-2,5.2525639083467121E-2,9.4877588686476347E-2,0.34807827475664521,-1,1.3679806413936677,4.7876635804708408E-3,9.2350308424436918,6.1029315536088591E-2,9.1740015269076025,"Con","Sw",0.39200000000000002,2.0951396048055169E-4,true,1,true,6.1029315536088591E-2,0,21523.677896484733,409.37433488667011,0,0,0,-1,-1,-1,-1,-1,-1,-1,-1,-1,-1,-1,-1,-1,-1,-1,-1,-1,-1,-1,48]
[56,"SW",1.5704948902130127,24.375,2.241875171661377,-1,-1,0.88468196046485237,1.0876265196800232,86,9,-1,-1,-1,1,1,0.14974479139252911,4.7577996214197366E-2,5.1756886961909492E-2,9.3756211547317211E-2,0.34283588611595317,-1,1.427495998638558,4.7217997098903276E-3,9.2398185060241627,6.5816979116559426E-2,9.1740015269076025,"Con","Sw",0.379,2.1429605892683823E-4,true,1,true,6.5816979116559426E-2,0,21523.677896484733,447.92121067643166,0,0,0,-1,-1,-1,-1,-1,-1,-1,-1,-1,-1,-1,-1,-1,-1,-1,-1,-1,-1,-1,56]
[37,"AW",1.5600183010101318,110.625,4.3048100471496582,-1,-1,0.45967361796422834,1.0866417202949523,24,84,-1,-1,-1,3,3,0.14594244526031047,4.1482222797901994E-2,7.0227589776438171E-2,0.30910108710437162,0.5667533449390223,-1,2.7594612475778257,2.1144749842552015E-2,9.2445403057340538,7.0538778826449752E-2,9.1740015269076025,"Dec","Aw",0.36699999999999999,3.7436277944092038E-4,true,1,true,7.0538778826449752E-2,0,21523.677896484733,486.20202362537384,0,0,0,-1,-1,-1,-1,-1,-1,-1,-1,-1,-1,-1,-1,-1,-1,-1,-1,-1,-1,-1,37]
[64,"SW",1.5089212656021118,24.375,2.3271615505218506,-1,-1,0.84079525143684586,1.0818385989665984,9,2,-1,-1,-1,1,1,0.13525950294597244,4.3778864757587625E-2,4.7532727710297269E-2,8.7535213769585521E-2,0.31410630918344284,-1,1.5422683764704135,4.3588072455041675E-3,9.2656850555766059,7.0538778826449752E-2,9.1951462767501546,"Con","Sw",0.35399999999999998,2.0592111090724684E-4,true,1,true,7.0538778826449752E-2,0,21696.254921033978,486.20202362537384,0,0,0,-1,-1,-1,-1,-1,-1,-1,-1,-1,-1,-1,-1,-1,-1,-1,-1,-1,-1,-1,64]
[55,"SW",1.479896068572998,24.375,1.9652378559112549,-1,-1,0.98923723928390317,1.0791102304458617,89,30,-1,-1,-1,1,1,0.12873918484545632,4.2044872157880914E-2,4.5607511963991335E-2,8.4664754418155547E-2,0.3010563233854841,-1,1.3279566705020385,4.1927304120873941E-3,9.27004386282211,7.4897586071953917E-2,9.1951462767501546,"Con","Sw",0.34100000000000003,1.6721409860648528E-4,true,1,true,7.4897586071953917E-2,0,21696.254921033978,522.98197947442532,0,0,0,-1,-1,-1,-1,-1,-1,-1,-1,-1,-1,-1,-1,-1,-1,-1,-1,-1,-1,-1,55]
[43,"SW",1.4699605703353882,24.375,1.9980096817016602,-1,-1,0.97085607047233557,1.0781762936115264,24,86,-1,-1,-1,1,1,0.12655202008467589,4.1459674120614048E-2,4.4958188418382103E-2,8.3691371823657171E-2,0.29666125444732921,-1,1.3592267180648197,4.1366223761539582E-3,9.2742365932341979,7.9090316484041315E-2,9.1951462767501546,"Con","Sw",0.32900000000000001,1.6782447497668701E-4,true,1,true,7.9090316484041315E-2,0,21696.254921033978,559.05444614589214,0,0,0,-1,-1,-1,-1,-1,-1,-1,-1,-1,-1,-1,-1,-1,-1,-1,-1,-1,-1,-1,43]
[68,"SW",1.4411575794219971,24.375,2.0696685314178467,-1,-1,0.93120879539325596,1.0754688124656677,99,16,-1,-1,-1,1,1,0.1203394372494636,3.9787247927155378E-2,4.3103674729619582E-2,8.0896150607295436E-2,0.28412651051353399,-1,1.4361153568285889,3.9761013508430986E-3,9.2783732156103511,8.3226938860195276E-2,9.1951462767501546,"Con","Sw",0.316,1.6735690260285131E-4,true,1,true,8.3226938860195276E-2,0,21696.254921033978,594.88473504781723,0,0,0,-1,-1,-1,-1,-1,-1,-1,-1,-1,-1,-1,-1,-1,-1,-1,-1,-1,-1,-1,68]
[60,"SW",1.4340535402297974,24.375,2.2824287414550781,-1,-1,0.84305527294850635,1.0748010327816009,12,82,-1,-1,-1,1,1,0.11883624789456286,3.93802529310915E-2,4.2652636823833863E-2,8.0212832775251749E-2,0.28108197042473998,-1,1.591592417873976,3.9369983944312304E-3,9.282349316961195,8.7203040211038377E-2,9.1951462767501546,"Con","Sw",0.30299999999999999,1.8295592456392049E-4,true,1,true,8.7203040211038377E-2,0,21696.254921033978,630.01295104622841,0,0,0,-1,-1,-1,-1,-1,-1,-1,-1,-1,-1,-1,-1,-1,-1,-1,-1,-1,-1,-1,60]
[57,"SW",1.4032732248306274,24.375,2.3891856670379639,-1,-1,0.79979861536997443,1.071907683134079,86,83,-1,-1,-1,1,1,0.11245514303114588,3.7641922858351183E-2,4.072741761488459E-2,7.728017801680194E-2,0.26810466152118362,-1,1.7025805272713974,3.769805842658105E-3,9.2862863153556265,9.1140038605469612E-2,9.1951462767501546,"Con","Sw",0.29099999999999998,1.8368852182733142E-4,true,1,true,9.1140038605469612E-2,0,21696.254921033978,664.96800608932972,0,0,0,-1,-1,-1,-1,-1,-1,-1,-1,-1,-1,-1,-1,-1,-1,-1,-1,-1,-1,-1,57]
[49,"SW",1.3589882850646973,24.375,2.3899400234222412,-1,-1,0.791510097761283,1.0677448987960816,33,25,-1,-1,-1,1,1,0.10364644692176322,3.5212339318951479E-2,3.8040084982517652E-2,7.3141159304179526E-2,0.25004003052741186,-1,1.7586170901454559,3.5356228476709295E-3,9.2900561211982851,9.4909844448127723E-2,9.1951462767501546,"Con","Sw",0.27800000000000002,1.726648467942647E-4,true,1,true,9.4909844448127723E-2,0,21696.254921033978,699.17279094457626,0,0,0,-1,-1,-1,-1,-1,-1,-1,-1,-1,-1,-1,-1,-1,-1,-1,-1,-1,-1,-1,49]
[75,"SW",1.3562769889831543,24.375,1.9110745191574097,-1,-1,0.98922655318230968,1.0674900369644165,72,6,-1,-1,-1,1,1,0.1031212617006845,3.5066324423110438E-2,3.7878713066644171E-2,7.2890847367012221E-2,0.24895714655745133,-1,1.4090591631951268,3.5215291900298571E-3,9.2935917440459566,9.8445467295798658E-2,9.1951462767501546,"Con","Sw",0.26500000000000001,1.3727844398978559E-4,true,1,true,9.8445467295798658E-2,0,21696.254921033978,732.29813039302826,0,0,0,-1,-1,-1,-1,-1,-1,-1,-1,-1,-1,-1,-1,-1,-1,-1,-1,-1,-1,-1,75]
[67,"SW",1.2310744524002075,24.375,1.9091583490371704,-1,-1,0.96176458252197006,1.0557209985256195,45,65,-1,-1,-1,1,1,8.0602744817000277E-2,2.8666028370527754E-2,3.0821475079255912E-2,6.1725669403520242E-2,0.20181591767030418,-1,1.5508065700777989,2.9013701816338403E-3,9.2971132732359862,0.10196699648582852,9.1951462767501546,"Con","Sw",0.253,1.1365910920454663E-4,true,1,true,0.10196699648582852,0,21696.254921033978,765.35738199949265,0,0,0,-1,-1,-1,-1,-1,-1,-1,-1,-1,-1,-1,-1,-1,-1,-1,-1,-1,-1,-1,67]
[69,"SW",1.1849938631057739,24.375,1.7584408521652222,-1,-1,0.6,1.0513894231319427,24,28,-1,-1,-1,1,1,7.3148471613221688E-2,2.6478540069370241E-2,2.8417420579338225E-2,5.7812906819843586E-2,0.18585733908177374,-1,1.4839240159071285,2.688231762572935E-3,9.3000146434176205,0.10486836666746235,9.1951462767501546,"Con","Sw",0.24,9.7152039829266019E-5,true,1,true,0.10486836666746235,0,21696.254921033978,795.3648217767477,0,0,0,-1,-1,-1,-1,-1,-1,-1,-1,-1,-1,-1,-1,-1,-1,-1,-1,-1,-1,-1,69]
[63,"SW",1.1520220041275024,24.375,1.8501242399215698,-1,-1,0.97390272030731795,1.0482900683879852,7,99,-1,-1,-1,1,1,6.8081855177027334E-2,2.4968610665803921E-2,2.6760655096779936E-2,5.5079160483514203E-2,0.1748902814231254,-1,1.6059799494218718,2.5407156019750569E-3,9.3027028751801932,0.10755659843003529,9.1951462767501546,"Con","Sw",0.22700000000000001,9.6815102039331724E-5,true,1,true,0.10755659843003529,0,21696.254921033978,824.24904718995094,0,0,0,-1,-1,-1,-1,-1,-1,-1,-1,-1,-1,-1,-1,-1,-1,-1,-1,-1,-1,-1,63]
[80,"SW",1.1120824813842773,24.375,2.2246487140655518,-1,-1,0.80214730539154455,1.044535753250122,49,59,-1,-1,-1,1,1,6.2237522304083505E-2,2.3201186697154486E-2,2.4824300559740803E-2,5.1842092178719199E-2,0.162105101739698,-1,2.0004349958794378,2.3676009440893897E-3,9.3052435907821689,0.11009731403201034,9.1951462767501546,"Con","Sw",0.215,1.0885777281833628E-4,true,1,true,0.11009731403201034,0,21696.254921033978,852.32958354055882,0,0,0,-1,-1,-1,-1,-1,-1,-1,-1,-1,-1,-1,-1,-1,-1,-1,-1,-1,-1,-1,80]
[54,"SW",1.1100015640258789,24.375,2.0773189067840576,-1,-1,0.85860295859626046,1.0443401470184326,31,65,-1,-1,-1,1,1,6.1941715243237383E-2,2.3110946884386308E-2,2.4725524774344722E-2,5.1675682669034217E-2,0.16145386957100263,-1,1.8714558376384651,2.3587487725773423E-3,9.3076111917262576,0.11246491497609973,9.1951462767501546,"Con","Sw",0.20200000000000001,1.0123176541916286E-4,true,1,true,0.11246491497609973,0,21696.254921033978,879.43659402430058,0,0,0,-1,-1,-1,-1,-1,-1,-1,-1,-1,-1,-1,-1,-1,-1,-1,-1,-1,-1,-1,54]
[52,"SW",1.1063293218612671,24.375,1.7574385404586792,-1,-1,0.6,1.0439949562549591,85,98,-1,-1,-1,1,1,6.1421782576028955E-2,2.2952144164678879E-2,2.4551722198938985E-2,5.138256109372237E-2,0.1603082100333692,-1,1.58853110527885,2.343167589976135E-3,9.309969940498835,0.11482366374867707,9.1951462767501546,"Con","Sw",0.189,8.4985273434827393E-5,true,1,true,0.11482366374867707,0,21696.254921033978,906.49288214743137,0,0,0,-1,-1,-1,-1,-1,-1,-1,-1,-1,-1,-1,-1,-1,-1,-1,-1,-1,-1,-1,52]
[71,"SW",1.0961883068084717,24.375,2.246431827545166,-1,-1,0.79129591813744105,1.0430417008399964,52,31,-1,-1,-1,1,1,5.9999758734699218E-2,2.2516558233278174E-2,2.4075135559086355E-2,5.0576715356406898E-2,0.15716816788347066,-1,2.0493119782362972,2.3004078233521386E-3,9.3123131080888104,0.1171668313386532,9.1951462767501546,"Con","Sw",0.17699999999999999,1.0690091117902216E-4,true,1,true,0.1171668313386532,0,21696.254921033978,933.45965936779976,0,0,0,-1,-1,-1,-1,-1,-1,-1,-1,-1,-1,-1,-1,-1,-1,-1,-1,-1,-1,-1,71]
[58,"SW",1.0734138488769531,24.375,1.4344602823257446,-1,-1,0.6,1.0409009017944335,13,7,-1,-1,-1,1,1,5.6879546005236294E-2,2.1554117450644006E-2,2.3022862322320363E-2,4.8786393261267949E-2,0.15024291903946863,-1,1.3363534333253966,2.2058140263788422E-3,9.3146135159121624,0.11946723916200534,9.1951462767501546,"Con","Sw",0.16400000000000001,6.5302059769383256E-5,true,1,true,0.11946723916200534,0,21696.254921033978,960.17924934625626,0,0,0,-1,-1,-1,-1,-1,-1,-1,-1,-1,-1,-1,-1,-1,-1,-1,-1,-1,-1,-1,58]
[53,"SW",1.0583500862121582,24.375,1.9842886924743652,-1,-1,0.88754971414598383,1.0394849081039428,88,48,-1,-1,-1,1,1,5.4871051914038217E-2,2.0929518239054694E-2,2.2340541039267442E-2,4.7617050215086158E-2,0.14575816140744652,-1,1.8748887710456446,2.1443378170205411E-3,9.3168193299385411,0.12167305318838419,9.1951462767501546,"Con","Sw",0.151,8.8126968743296982E-5,true,1,true,0.12167305318838419,0,21696.254921033978,986.34371191263199,0,0,0,-1,-1,-1,-1,-1,-1,-1,-1,-1,-1,-1,-1,-1,-1,-1,-1,-1,-1,-1,53]
[51,"SW",1.0267817974090576,24.375,1.6030158996582031,-1,-1,0.6,1.0365174889564515,35,63,-1,-1,-1,1,1,5.0803146090437498E-2,1.965149312522713E-2,2.0945886772701525E-2,4.5205071235094818E-2,0.13660559722346097,-1,1.5612040491009802,2.0183237362006406E-3,9.3189636677555612,0.12381739100540473,9.1951462767501546,"Con","Sw",0.13900000000000001,6.7020159123637056E-5,true,1,true,0.12381739100540473,0,21696.254921033978,1012.1409952640533,0,0,0,-1,-1,-1,-1,-1,-1,-1,-1,-1,-1,-1,-1,-1,-1,-1,-1,-1,-1,-1,51]
[70,"SW",1.0223438739776611,24.375,2.109210729598999,-1,-1,0.82756550781632943,1.0361003241539002,23,24,-1,-1,-1,1,1,5.0246463007049921E-2,1.9475177293814136E-2,2.0753642052651122E-2,4.4870194828563879E-2,0.13534547718207907,-1,2.0631127972554237,2.0009143722345018E-3,9.3209819914917613,0.12583571474160538,9.1951462767501546,"Con","Sw",0.126,8.7623380694590311E-5,true,1,true,0.12583571474160538,0,21696.254921033978,1037.1688015758991,0,0,0,-1,-1,-1,-1,-1,-1,-1,-1,-1,-1,-1,-1,-1,-1,-1,-1,-1,-1,-1,70]
[46,"SW",0.97931563854217529,24.375,2.1005153656005859,-1,-1,0.8220887556351314,1.0320556700229644,1,58,-1,-1,-1,1,1,4.5040546928719317E-2,1.7808436201394089E-2,1.893835791141725E-2,4.1677497682625339E-2,0.12346483872415599,-1,2.1448808565208313,1.8360304739247562E-3,9.322982905863995,0.12783662911383989,9.1951462767501546,"Con","Sw",0.113,8.026948034771191E-5,true,1,true,0.12783662911383989,0,21696.254921033978,1062.0884335041046,0,0,0,-1,-1,-1,-1,-1,-1,-1,-1,-1,-1,-1,-1,-1,-1,-1,-1,-1,-1,-1,46]
[65,"SW",0.90722167491912842,24.375,1.3307852745056152,-1,-1,0.6,1.025278837442398,71,79,-1,-1,-1,1,1,3.7079103914276934E-2,1.5188932506848322E-2,1.6093471764122517E-2,3.6550607487836603E-2,0.10491211567308438,-1,1.4668799382733488,1.5756557585240353E-3,9.3248189363379197,0.12967265958776464,9.1951462767501546,"Con","Sw",0.10100000000000001,4.3690608473486417E-5,true,1,true,0.12967265958776464,0,21696.254921033978,1085.9592521935701,0,0,0,-1,-1,-1,-1,-1,-1,-1,-1,-1,-1,-1,-1,-1,-1,-1,-1,-1,-1,-1,65]
[47,"SW",0.84819293022155762,24.375,1.63005530834198,-1,-1,0.6,1.0197301354408264,78,35,-1,-1,-1,1,1,3.1246792713444035E-2,1.3204797903935991E-2,1.3946067021389489E-2,3.2563993546110226E-2,9.0961651184879741E-2,-1,1.9217978012575405,1.3772849512221771E-3,9.3263945920964435,0.13124831534628867,9.1951462767501546,"Con","Sw",8.7999999999999995E-2,4.7040531659364046E-5,true,1,true,0.13124831534628867,0,21696.254921033978,1108.0727805197239,0,0,0,-1,-1,-1,-1,-1,-1,-1,-1,-1,-1,-1,-1,-1,-1,-1,-1,-1,-1,-1,47]
[61,"SW",0.81800371408462524,24.375,1.7793563604354858,-1,-1,0.9310471492950495,1.0168923491239548,69,95,-1,-1,-1,1,1,2.8495035611044921E-2,1.224567829860481E-2,1.2910627333105495E-2,3.059986093906741E-2,8.4251202181822638E-2,-1,2.1752423978009046,1.2809879866037632E-3,9.327771877047665,0.13262560029751086,9.1951462767501546,"Con","Sw",7.4999999999999997E-2,4.7886765715766775E-5,true,1,true,0.13262560029751086,0,21696.254921033978,1128.7474831938744,0,0,0,-1,-1,-1,-1,-1,-1,-1,-1,-1,-1,-1,-1,-1,-1,-1,-1,-1,-1,-1,61]
[42,"SW",0.73249536752700806,24.375,1.6771692037582397,-1,-1,0.96558928736841121,1.0088545645475386,61,33,-1,-1,-1,1,1,2.1517796161829243E-2,9.732232222085949E-3,1.0206464833543842E-2,2.5316741548457145E-2,6.6773234765916178E-2,-1,2.2896652704037752,1.0271745977131254E-3,9.329052865034269,0.13390658828411461,9.1951462767501546,"Con","Sw",6.3E-2,3.6410002575958563E-5,true,1,true,0.13390658828411461,0,21696.254921033978,1148.6863237246871,0,0,0,-1,-1,-1,-1,-1,-1,-1,-1,-1,-1,-1,-1,-1,-1,-1,-1,-1,-1,-1,42]
[66,"SW",0.69933807849884033,24.375,1.7390155792236328,-1,-1,0.92294966818117574,1.0057377793788909,38,30,-1,-1,-1,1,1,1.9126010023597317E-2,8.837990922896501E-3,9.2480630440144561E-3,2.3381574505585083E-2,6.0593638496093359E-2,-1,2.48665936074367,9.3628670722105628E-4,9.3300800396319818,0.13493376288182773,9.1951462767501546,"Con","Sw",0.05,3.4509938068478863E-5,true,1,true,0.13493376288182773,0,21696.254921033978,1166.5408983081579,0,0,0,-1,-1,-1,-1,-1,-1,-1,-1,-1,-1,-1,-1,-1,-1,-1,-1,-1,-1,-1,66]
[41,"SW",0.48012784123420715,24.375,1.4110321998596191,-1,-1,0.6,0.98513201707601539,41,64,-1,-1,-1,1,1,7.3478643680050136E-3,4.041217506076257E-3,4.1530733584620458E-3,1.2260296819916987E-2,2.7802452052460305E-2,-1,2.938867690389392,4.4131459052500048E-4,9.3310163263392027,0.1358700495890488,9.1951462767501546,"Con","Sw",3.6999999999999998E-2,1.3464583779322992E-5,true,1,true,0.1358700495890488,0,21696.254921033978,1183.5872639715672,0,0,0,-1,-1,-1,-1,-1,-1,-1,-1,-1,-1,-1,-1,-1,-1,-1,-1,-1,-1,-1,41]
[45,"SW",-1,24.375,1.0626165866851807,-1,-1,0.6,-1,82,34,-1,-1,-1,1,1,-1,-1,-1,-1,-1,-1,-1,-1,-1,-1,-1,"Con","Sw",-1,-1,false,1,true,0.13631136417957379,0,21696.254921033978,1195.290380101651,0,0,0,-1,-1,-1,-1,-1,-1,-1,-1,-1,-1,-1,-1,-1,-1,-1,-1,-1,-1,-1,45]
[76,"SW",-1,24.375,1.1933311223983765,-1,-1,0.6,-1,41,60,-1,-1,-1,1,1,-1,-1,-1,-1,-1,-1,-1,-1,-1,-1,-1,"Con","Sw",-1,-1,false,1,true,0.13631136417957379,0,21696.254921033978,1195.290380101651,0,0,0,-1,-1,-1,-1,-1,-1,-1,-1,-1,-1,-1,-1,-1,-1,-1,-1,-1,-1,-1,76]
[77,"SW",-1,24.375,1.2768107652664185,-1,-1,0.6,-1,71,45,-1,-1,-1,1,1,-1,-1,-1,-1,-1,-1,-1,-1,-1,-1,-1,"Con","Sw",-1,-1,false,1,true,0.13631136417957379,0,21696.254921033978,1195.290380101651,0,0,0,-1,-1,-1,-1,-1,-1,-1,-1,-1,-1,-1,-1,-1,-1,-1,-1,-1,-1,-1,77]
[]
[]
["YIELDS",22,"Distribution Example CP",null,null,"12:52 18 Dec 2024"]
["YIELDS",null,"Distribution Example CP",null,"12:52 18 Dec 2024",null,"Distribution Example CP",null,null,null,null,null,null,null,null,null,null,null,null,null,null,null,null,null,null,null,null,null,null,null,null,null,null,null,null,null,null,null,null,null,null,null,null,null,null,null,null,null,null,null,null,null,null,null,null,null,null,"Taper",null,"Vol/tree",null,"Volume Mai",null,"Spacing (m)",null,"Trees/Vol"]
["stID","stWT","Age","C_Den","D_Den","C_AvDbh","D_AvDbh","C_AvHt","D_AvHt","C_Ba","D_Ba","C_Vol","D_Vol","C_Slndr","D_Slndr","stQMD","StVol","stBa","stDensity","stavHt","stavDbh","C_Tden","D_Tden","C_TopHt","D_TopHt","stDenDead","C_DenDead","D_DenDead","stBaDead","C_BaDead","D_BaDead","stVolDead","C_VolDead","D_VolDead","stBaSurvGrowth","C_BaSurvGrowth","D_BaSurvGrowth","stVolSurvGrowth","C_VolSurvGrowth","D_VolSurvGrowth","stBWood","stBBark","stBBranch","stBFoliage","stBTotal","C_stBWood","D_stBWood","C_stBBark","D_stBBark","C_stBBranch","D_stBBranch","C_stBFoliage","D_stBFoliage","C_stBTotal","D_stBTotal","stCC","Age2","C_Tapr","D_Tapr","C_VPT","D_VPT","C_Mai","D_Mai","C_space","D_space","C_TPM","D_TPM","C_netvalue","D_netvalue","C_NPV","D_NPV","stNPV","SF","st_TDen","stMAI","stSlndr"]
["MED-1-5-M12-SW13-AW13",1,13,901.875,4425,1.1509388513863086,4.9031084567308429,2.0030419021844863,7.3112443923950199,0.13631136417957379,9.1951462767501546,0.15153070345477454,33.160982979686807,1.7403547545308924,1.4911447415278687,4.7227347127846109,33.312513683141582,9.3314576409297274,5326.875,6.3528189427736734,4.2256333890991904,975,4425,2.6373444259166718,10.044910430908203,0,0,0,0,0,0,0,0,0,0,0,0,0,0,0,13771.155127332135,2760.6390265678183,3798.0191085725455,7186.2318940698042,27516.045156542303,104.3871418369698,13666.767985495168,33.38595345850969,2727.2530731093088,36.266671571346052,3761.7524370012006,66.891887283532171,7119.3400067862731,240.9316541503577,27275.113502391941,100,13,1.7403547545308924,1.4911447415278687,1.6801741200806602E-4,7.4940074530365662E-3,1.165620795805958E-2,2.550844844591293,3.3298665270564656,1.5032920560056577,5951.7640942594271,133.43995269110664,-2.5448922794837712,-225.8571763919156,-1.3496107109026163,-119.77688283709324,-121.12649354799585,0.21567373980942248,5400,2.5625010525493526,1.503400403632259]
["MED-1-5-M12-SW13-AW13",1,20,860.54896836233434,3294.2850460762229,4.9299386362783775,8.4889261025906126,4.2624619300370803,11.070309498854648,1.6594801713554115,20.032597724065855,3.324858449832139,104.80576000882725,0.86460750214425042,1.3040883340327654,8.1532131781803692,108.13061845865938,21.692077895421264,4154.8340144385575,9.6602685244727535,7.7517888350352129,860.54896836233434,3294.2850460762229,5.1140215092177632,14.114350914377191,1245.0837421849674,114.36878826119022,1130.7149539237771,3.9644613977143601,0.10689977662496268,3.8575616210893977,17.432760652104331,0.18614544746797396,17.24661520463636,15.784883618851602,1.5989876933108544,14.185895925540748,89.267561133744977,3.3019915382585117,85.965569595486443,46903.589391959416,10819.056180752405,7289.3855527159194,4355.8371826382108,69367.868308065968,1924.7213450328079,44978.868046926626,398.84909217148663,10420.207088580913,682.69479291198661,6606.6907598039306,1435.9181034478192,2919.919079190392,4442.1833335640995,64925.684974501841,100,20,0.86460750214425042,1.3040883340327654,3.8636481735135919E-3,3.181441755735738E-2,0.16624292249160694,5.2402880004413621,3.4088838654639941,1.7422858622981516,258.82273827500251,31.432290036337339,-28.435818046268221,-315.48320842256345,-10.717160758528768,-118.90230327749501,-129.61946403602377,0.16059571830117486,4154.8340144385575,5.4065309229329692,1.2461986168678796]
["MED-1-5-M12-SW13-AW13",1,30,736.48602581062141,2000.0971181907576,8.1913913160013081,13.327800658828631,7.4253187956931956,15.161440626093901,3.8931224745868565,29.08023375665913,12.991000671105827,201.50247834103646,0.90647833917888365,1.1375800864826582,12.386035282672436,214.49347901214219,32.973356231245994,2736.5831440013794,13.079448111250093,11.945458699978378,736.48602581062141,2000.0971181907576,8.3183940986656939,18.368263657995513,1418.2508704371794,124.06294255171316,1294.1879278854663,8.9242192807753788,0.4543994105724834,8.4698198702028975,48.66223625274916,1.2759096099312119,47.386326642817963,19.592824647130911,2.6465907905679003,16.946233856563012,150.75488563722692,10.774758694345394,139.98012694288153,85202.577652105581,18849.764337799181,13519.421733044133,6219.7487579412991,123791.51248089017,6013.4144562477541,79189.163195857822,1087.2735591926973,17762.490778606472,1668.5185663833463,11850.903166660784,2581.7209038142637,3638.0278541270318,11350.927485638062,112440.58499525212,100,30,0.90647833917888365,1.1375800864826582,1.7639167907913988E-2,0.10074634701904427,0.43303335570352758,6.7167492780345492,3.6848324445590142,2.2360136887578443,56.692016608750578,9.925918205361512,-59.247156258683383,4.032351473532783,-13.708455855249118,0.93299519602970538,-12.775460659219412,0.14615250282175685,2736.583144001379,7.1497826337380728,1.094930587410073]
["MED-1-5-M12-SW13-AW13",1,40,638.79520357578076,1437.8116625001257,10.564867345784338,17.116313526655798,10.249942898950287,18.231696338448454,5.615397861713296,34.276070312333573,25.397221880395708,279.96417963254567,0.97019134869121537,1.0651648972225025,15.639322189226318,305.36140151294137,39.891468174046885,2076.6068660759065,15.776390090275076,15.100991096014958,638.79520357578076,1437.8116625001257,10.981968108695256,21.471151511424313,659.97627792547121,97.690822234840297,562.2854556906309,8.6872676310836887,0.69477982707643382,7.9924878040072551,58.345168115764167,2.7938172529479819,55.551350862816186,15.259442492829319,2.3830218199870652,12.876420672842258,146.14210046295869,14.986881687079631,131.15521877587906,114737.23234798182,24727.259998859219,18301.420562691877,7171.9225385761683,164937.83544810914,10043.787059755879,104693.44528822595,1693.3856769564318,23033.874321902782,2457.4951470188976,15843.925415672984,3252.1782533271962,3919.7442852489739,17446.846137058408,147490.98931105074,100,40,0.97019134869121537,1.0651648972225025,3.9758003407398497E-2,0.19471547417116683,0.63493054700989271,6.9991044908136413,3.9565729427470493,2.6372360212261516,25.152168476697494,5.1356986611189352,-61.568785635180681,490.5576200983374,-8.7455801639487838,69.68159185446882,60.936011690520033,0.13909618572655791,2076.6068660759065,7.6340350378235344,1.0447254746371151]
["MED-1-5-M12-SW13-AW13",1,50,559.3886635787195,1135.5984711449833,12.498038187429371,20.155532831745372,12.679093186580852,20.505818680623765,6.8827143998147777,37.575238463925011,38.046285086414933,341.20493236417542,1.0144866735431797,1.0173791410925483,18.274545591820782,379.25121745059045,44.457952863739813,1694.9871347237031,17.922801131629896,17.628365747292314,559.3886635787195,1135.5984711449833,13.517316229164113,23.825056489530652,381.61973135220376,79.406539997061401,302.21319135514238,7.8926386624581433,0.84235942507013783,7.050279237388005,61.718771808914141,4.2869446752411902,57.43182713367294,12.239467409729455,2.0820057104220808,10.157461699307374,133.32346887035828,16.714497513664647,116.60897135669367,137711.4721899401,29137.394808603993,21986.545502453278,7687.4023956272122,196522.81489662451,13567.409083787028,124144.06310615306,2183.8626964199893,26953.532112184006,3054.1275275819535,18932.417974871321,3644.2574857059622,4043.1449099212523,22449.656793494927,174073.15810312959,100,50,1.0144866735431797,1.0173791410925483,6.8014043836733748E-2,0.30046265562523233,0.76092570172829865,6.8240986472835088,4.2280797423539784,2.9674786321065523,14.702845818144244,3.3282006308541119,-38.534128245556879,986.95139430313111,-3.3603195986442413,86.06583992382059,82.705520325176352,0.13552234597453011,1694.9871347237026,7.5850243490118086,1.0167023641645743]
["MED-1-5-M12-SW13-AW13",1,60,493.53611017666151,942.03535888785734,14.153321842167925,22.670363408952742,14.742669097235165,22.211764128063621,7.7896540370149765,39.561615393922096,49.611006292058619,386.44170577654046,1.0416402072700246,0.97977097796729562,20.493137938915261,436.05271206859913,47.351269430937037,1435.5714690645191,19.643958771457413,19.742283786540707,493.53611017666151,942.03535888785734,15.703407449861196,25.671369016538591,259.41566565918396,65.852553402058078,193.56311225712585,7.3513474315750091,0.92688726409136557,6.4244601674836437,64.187420121295375,5.554483310525919,58.632936810769458,10.08915026861353,1.8111639119197314,8.2779863566937966,119.18876253839052,16.908116589184282,102.28064594920625,155069.67765160248,32355.447339704489,24745.656049867543,7928.7584803587797,220099.53952153338,16503.427798053373,138566.24985354909,2566.6553797360771,29788.791959968425,3492.2586477618688,21253.397402105664,3859.2033516081369,4069.5551287506396,26421.545177159449,193677.9943443739,100,60,1.0416402072700246,0.97977097796729562,0.10052153281003154,0.41021995844483328,0.82685010486764365,6.4406950962756744,4.5013266844742761,3.2581149145702115,9.9481173042777673,2.4377165942658072,0.70143685367198794,1434.1148469383829,3.7551789336422919E-2,76.776089443469758,76.813641232806177,0.13435646748510174,1435.5714690645189,7.267545201143319,0.99501957239869443]
["MED-1-5-M12-SW13-AW13",1,70,438.34300109318758,785.54726927731019,15.626006820233064,24.966514524890705,16.5016396419519,23.68419565289436,8.4359972204718705,40.108958357233988,59.683461170613512,414.42157004204,1.0560368897692427,0.94863845048463136,22.472731978067202,474.1050312126535,48.544955577705856,1223.8902703704978,21.111723893311424,21.621160551487332,438.34300109318758,785.54726927731019,17.520202034169969,27.157028908033951,211.68076690775374,55.19310908347385,156.48765782427989,7.3687071091723038,0.96612304162051088,6.4025840675517909,68.765797093005745,6.5224667403259184,62.243330352679827,8.4377260823761802,1.5936236318785508,6.8441024504976298,105.28824553465127,16.401377759905554,88.886867774745681,166280.54171816271,34286.771204979901,26519.849030713591,7940.4605465259883,235027.62250038231,18930.726410259758,147349.81530790293,2864.5010104194994,31422.270194560413,3813.1240789911963,22706.724951722394,3963.7648916780572,3976.6956548479343,29572.116391348511,205455.50610903377,100,70,1.0560368897692427,0.94863845048463136,0.13615698442034752,0.52755777564257922,0.85262087386590735,5.9203081434577145,4.7763150075734409,3.5679095690177971,7.3444634827749491,1.8955269852329892,48.451794907966381,1812.0129646091045,1.5924248101839373,59.553921721567797,61.146346531751732,0.13539575909903231,1223.8902703704978,6.7729290173236212,0.9764380521127547]
["MED-1-5-M12-SW13-AW13",1,80,391.82886287485269,659.20744975307139,16.979162030408474,27.069937605831903,18.015331344902457,24.956197053730662,8.9068036872259917,39.647407230705895,68.341177835848612,428.12061734532136,1.0610259394803039,0.92191557354584153,24.252675119692647,496.46179518117009,48.55421091793189,1051.0363126279237,22.368625639326087,23.308072224266173,391.82886287485269,659.20744975307139,19.050207775360516,28.364190170420706,172.8536018256558,46.514138218334971,126.33946360732084,7.2096579271477852,0.9736421086091841,6.2360158185386023,71.251877811804746,7.1973817613848379,64.054496050419928,7.1168013664241663,1.4285057836995838,5.6882955827245825,92.297858108584009,15.680392996300416,76.617465112283583,172569.01673638995,35210.823788746791,27505.873238342861,7814.3058387598867,243100.01960223948,20977.501375857075,151591.51536053282,3101.824442002353,32108.999346744422,4053.7401428782227,23452.133095464651,4002.759281791889,3811.5465569679986,32135.825242529532,210964.19435970992,100,80,1.0610259394803039,0.92191557354584153,0.17441588486980933,0.64944748046413692,0.85426472294810762,5.351507716816517,5.0518656004874085,3.8948339472184501,5.7334227369625088,1.5397703895707404,99.969010490426655,2105.8492657636557,2.0170723114285662,42.489669800430953,44.506742111859516,0.13789605388401779,1051.036312627924,6.2057724397646261,0.95969436786101847]
["MED-1-5-M12-SW13-AW13",1,90,352.3972490515298,549.0174870861357,18.254080756352753,29.145053626330906,19.329389841777179,26.156050292365318,9.2628538529030227,38.332880473415536,75.803400670367736,429.4885781658686,1.0589078737942035,0.89744388971495348,25.928461517551028,505.29197883623635,47.595734326318535,901.41473613766539,23.487249498954821,24.887358777320806,352.3972490515298,549.0174870861357,20.350512668839603,29.378540822968979,149.62123891261899,39.43161382332292,110.18962508929607,7.2257449194894789,0.96201570114346624,6.2637292183460138,74.349633612834978,7.6363288136901426,66.713304799144836,6.1780561889950096,1.3043352224627933,4.8737209665322165,82.00470728496704,14.941483257683965,67.063224027283056,174732.66120457198,35291.292619561958,27836.297929212516,7587.3921636496461,245447.64391699623,22758.355678902146,151974.30552566986,3297.9323623676569,31993.36025719429,4241.2308541452776,23595.067075067225,4003.979546929454,3583.4126167201912,34301.498442344535,211146.14547465165,100,90,1.0589078737942035,0.89744388971495348,0.21510781050190114,0.78228578919287839,0.84226000744853036,4.7720953129540957,5.3270128604551923,4.2678280275609817,4.6488316610482254,1.2783052099562586,152.67138710923149,2322.6902113571255,1.8911271739738438,28.770961334606962,30.662088508580805,0.14180956081749013,901.4147361376655,5.614355320402626,0.94374215074836032]
["MED-1-5-M12-SW13-AW13",1,100,318.73048585186467,457.57859102818537,19.483901328207878,31.271165862211134,20.480200654922154,27.204038748975499,9.5502936692520652,36.894326819361289,82.350749924880759,425.72704997603205,1.0511344884133591,0.8699400229861447,27.599768320681829,508.07779990091285,46.444620488613346,776.30907688004982,24.443421558822475,26.431649407133268,318.73048585186467,457.57859102818537,21.522546292312864,30.240325488987246,125.10520873618428,33.666763199665091,91.438445536519225,7.1118924775045356,0.94103968330832499,6.1708527941962101,76.448165483536087,7.9106034285201012,68.537562055015982,5.8750432693156522,1.2163911613502705,4.6586521079653815,78.094071733358547,14.315826911859061,63.778244821499456,175993.22440645494,35192.687712577244,28019.114499832958,7341.0742336942012,246546.10085255958,24379.346833005926,151613.87757344911,3468.9244537298828,31723.763258847372,4396.6893911891721,23622.425108643791,3985.7285533249037,3355.3456803692966,36230.689231249889,210315.41162130958,100,100,1.0511344884133591,0.8699400229861447,0.25837111158282688,0.93039110291287341,0.82350749924880762,4.2572704997603203,5.6012917966780762,4.6748443084127791,3.8704017406351041,1.0748168129179165,205.53031593485375,2496.39166385003,1.5629532317863759,18.983785438522339,20.546738670308716,0.146831985046217,776.30907688005004,5.0807779990091282,0.92477851768969754]
["MED-1-5-M12-SW13-AW13",1,110,289.75891420104193,386.87941606425665,20.698421654712909,33.06014704609138,21.494271195329937,27.975368408283469,9.8058596156686768,34.978776395568389,88.273023412851728,412.49481789249137,1.0384497694506971,0.84619612759982954,29.029615638981809,500.76784130534321,44.784636011237062,676.63833026529869,25.199948206296831,27.766447344431157,289.75891420104193,386.87941606425665,22.514929859735084,30.959135874754384,99.670746614751266,28.971571650822657,70.699174963928613,6.8539843027138501,0.91710512597832916,5.9368791767355198,77.043763041694092,8.0796318945222669,68.964131147171827,5.1183291379509352,1.1617540761351188,3.9565750618158151,68.707910613754777,13.871619812040073,54.836290801714725,173890.23771926004,34434.443124123798,27654.214571331871,7072.235471996778,243051.13088671275,25941.839342331059,147948.39837692914,3628.825716543065,30805.617407580721,4537.308237168897,23116.906334162974,3960.594140607282,3111.6413313894982,38068.567436650301,204982.56345006239,100,110,1.0384497694506971,0.84619612759982954,0.30464299487126639,1.0662102990353466,0.80248203102592475,3.7499528899317398,5.8746445880063884,5.0840778042054788,3.2825307551305163,0.93790127604727658,258.54018233429684,2566.5567428394747,1.2069941163101265,11.981962957610186,13.188957073920312,0.15255345706322107,676.63833026529858,4.5524349209576656,0.907568328555037]
["MED-1-5-M12-SW13-AW13",1,120,264.74598952264262,326.10327346273783,21.882445483296287,34.592885226855195,22.394270423954417,28.613270588238162,10.019582368460318,32.353951085306321,93.491141307205567,388.23856680257398,1.0233897505216603,0.82714322325519896,30.217884057509863,481.72970810977955,42.373533453766626,590.84926298538062,25.826679395730384,28.897628994878328,264.74598952264262,326.10327346273783,23.412071466749076,31.571433726418519,85.7890672799182,25.012924678399322,60.776142601518885,6.7896559819238531,0.88862879437639586,5.9010271875474576,78.43072375070696,8.139212191195254,70.291511559511719,4.312391022481088,1.0926233120130551,3.2197677104680316,58.482007306334737,13.239567660393526,45.242439645941232,167441.85899022021,32819.256328270436,26590.958856969821,6754.555946742089,233606.63012220259,27388.860978974826,140052.99801124533,3771.8616564758099,29047.394671794616,4657.8162174168474,21933.142639552978,3927.1850436571017,2827.3709030849882,39745.723896524585,193860.90622567802,100,120,1.0233897505216603,0.82714322325519896,0.35313525041787142,1.1905386986154742,0.7790928442267131,3.2353213900214497,6.1458973883479819,5.5376106964824379,2.8317762070387524,0.8399558965726529,310.12611869588841,2528.201087484661,0.88883767665032765,7.2459565487558208,8.1347942254061483,0.15929167519419599,590.84926298538039,4.0144142342481626,0.89373004962821612]
["MED-1-5-M12-SW13-AW13",1,130,243.07708357233889,273.33635905574016,22.99726328534954,35.871360821591445,23.198774812698293,29.145151632283437,10.162353686687979,29.196613170916073,97.752868390513811,355.3426692613632,1.0087624133727742,0.81249082735496858,31.151440565428977,453.0955376518769,39.358966857604052,516.41344262807888,26.346177369005193,29.811491297650132,243.07708357233889,273.33635905574016,24.199126773886452,32.068340917368403,74.435820357301537,21.668905950303859,52.766914406997692,6.6212027883168254,0.85487273147703124,5.7663300568397933,78.10790499002168,8.0909310739047573,70.016973916116925,3.5502359227350833,0.98928415787568436,2.5609517648593991,48.685937603680095,12.249363998771669,36.436573604908432,157291.0731795363,30494.483225073654,24934.55366931848,6394.6432477373273,219114.75332166586,28592.250205240693,128698.82297429557,3883.782090268201,26610.701134805455,4743.6379282358057,20190.91574108267,3878.6341131883169,2516.0091345490118,41098.304336933012,178016.44898473279,100,130,1.0087624133727742,0.81249082735496858,0.40214761076571376,1.3000197649845036,0.75194514146549085,2.7334051481643322,6.4139857610932758,6.0485503113165366,2.4866491139806564,0.76921907415147661,357.66125136397932,2396.1620189665709,0.62930765210155915,4.2160650292984183,4.8453726813999776,0.16702582260861037,516.41344262807911,3.4853502896298223,0.88375912180823746]
["MED-1-5-M12-SW13-AW13",1,140,224.20337323264448,227.87108212040977,24.015014805803734,36.871804023195253,23.922219495649717,29.580425930985925,10.220761466512059,25.737065235946478,100.935173515725,316.87317518117561,0.99613594616099965,0.80225057370063912,31.823415776767273,417.80834869690057,35.957826702458526,452.0744553530543,26.774275408151542,30.495563389936933,224.20337323264448,227.87108212040977,24.869395791416377,32.421855264537875,64.338987275024621,18.873710339694274,45.465276935330344,6.2970108305398433,0.81684660044314339,5.4801642300966993,75.54897391974275,7.9518536539869711,67.597120265755791,2.8492837304863059,0.86829349010648693,1.9809902403798185,39.600793419971026,11.045844736675189,28.554948683295827,144495.96924078203,27683.252110993006,22855.983047888236,6006.6742005664728,201041.87860022963,29483.132479257172,115012.83676152489,3957.4501044987542,23725.80200649425,4787.902626030449,18068.080421857783,3812.0521520096499,2194.6220485568206,42040.537361796021,159001.34123843367,100,140,0.99613594616099965,0.80225057370063912,0.45019471411337636,1.3905809031693459,0.72096552511232137,2.2633798227226829,6.6784999764267781,6.6245349031963938,2.221261086926404,0.71912392707310124,399.25111760500823,2192.8485866112392,0.43126505660984421,2.368682085386979,2.7999471419968232,0.17566178427867238,452.07445535305425,2.9843453478350042,0.87797280757851615]
["MED-1-5-M12-SW13-AW13",1,150,207.64252818540774,189.06501620345125,24.936727671632301,37.660342153806255,24.575885416948505,29.928083463698361,10.205163203836157,22.278557295981852,103.1289668611021,276.81869740084807,0.98552968699681132,0.79468432181181314,32.288859999699412,379.94766426195031,32.483720499817998,396.70754438885899,27.126664762452826,31.000616327807407,207.64252818540774,189.06501620345125,25.460552996881592,32.559291678845675,55.366910964195242,16.56084504723675,38.806065916958495,5.8437951959160657,0.77707446695306648,5.0667207289629994,71.06251974802575,7.7528623337511107,63.309657414274618,2.3308661876440731,0.75571729509723895,1.5751488925468347,32.646204092082399,9.8716414432379693,22.77456264884443,130656.16680421679,24708.085623776977,20610.968514282955,5615.7092764810232,181590.93021875786,30081.840185442623,100574.32661877421,3996.4097527774575,20711.675870999519,4795.3660894438808,15815.602424839075,3730.8751543302901,1884.8341221507335,42604.49118199425,138986.43903676362,100,150,0.98552968699681132,0.79468432181181314,0.49666591792321269,1.4641455249603967,0.68752644574068067,1.8454579826723205,6.9397183674771306,7.2726788774114244,2.0134258541062313,0.68299221829541068,434.56140808454973,1953.1738610769673,0.28817499546376807,1.2952274594210957,1.5834024548848638,0.18508378392869221,396.70754438885899,2.5329844284130019,0.87503630494340645]
["MED-1-5-M12-SW13-AW13",1,160,192.98941265459734,156.27407146540847,25.756386749948028,38.230865643930059,25.168925577504215,30.197301401980351,10.117644256598735,18.970309711362386,104.35345055468491,237.41676036583996,0.97719163102545825,0.78986705881128272,32.563798252404503,341.77021092052502,29.087953967961131,349.26348412000601,27.418816558604053,31.337953947227799,192.98941265459734,156.27407146540847,26.004788876588545,32.394798023908791,47.444060268853164,14.653115530810433,32.790944738042732,5.3005776378107532,0.73744323322504146,4.5631344045857114,65.138737610313271,7.5186519346862317,57.620085675627038,1.8732244757473673,0.64523209097701417,1.2279923847703518,26.505152531364118,8.680185352186875,17.824967179177239,116622.32116624758,21739.552307137084,18337.577847323559,5232.2082871460634,161931.65960785432,30382.630035058406,86239.691131189174,4000.8283255688939,17738.723981568193,4766.8449643840868,13570.732882939468,3635.932888890005,1596.2753982560596,42786.236213901393,119145.42339395294,100,160,0.97719163102545825,0.78986705881128272,0.54072111583370341,1.5192332172544218,0.65220906596678074,1.4838547522864998,7.1983549492366468,7.9993838416774308,1.849382187448263,0.6582267874626998,463.03483852308858,1698.2134219311129,0.18850627742420276,0.69136026883231716,0.87986654625651994,0.1951527623362147,349.26348412000584,2.1360638182532812,0.8749395893802302]
["MED-1-5-M12-SW13-AW13",1,170,179.9173322490835,128.88931226024141,26.482592163010928,38.599478856559692,25.708919689402833,30.398442443571568,9.9706929933331203,15.935668154857868,104.73093298665243,200.54376286773652,0.97078562140572078,0.78753504824600973,32.682475846879264,305.27469585438882,25.906361148190982,308.80664450932483,27.666226545846833,31.53992243888074,179.9173322490835,128.88931226024141,26.485628252845295,31.915117722769168,40.456839610681016,13.072080405513894,27.384759205167114,4.6935794544127258,0.6986451141040495,3.9949343403086761,58.141651225350458,7.2620966910679829,50.879554534282477,1.4869833159668677,0.54787370643352462,0.93910960953334344,21.281685966051324,7.5868160425940605,13.69486992345727,103159.52633478906,18926.916976642136,16158.712841013874,4867.329264370911,143112.48541681594,30422.802627239384,72736.723707549696,3975.785598076448,14951.131378565684,4708.3110810723656,11450.401759941511,3530.6514699793684,1336.6777943915424,42637.550776367571,100474.93464044839,100,170,0.97078562140572078,0.78753504824600973,0.58210585760386591,1.5559378768568262,0.6160643116861908,1.1796691933396266,7.4552720954308729,8.8082888260969217,1.7179005964934284,0.64269918155094674,485.01403365440109,1447.0507870942013,0.12121977205137653,0.36166204354267012,0.48288181559404664,0.20568695692193018,308.80664450932488,1.7957335050258165,0.87718118519344801]
["MED-1-5-M12-SW13-AW13",1,180,168.15881037453403,106.28466297328721,27.130916479995697,38.816550268893423,26.202054043790142,30.543461413205257,9.7799893819378649,13.269222014355627,104.42336498282516,167.66612885550609,0.96576369114215399,0.78686697302109287,32.700669272593821,272.08949383833124,23.049211396293487,274.44347334782123,27.883365730525853,31.656451861586536,168.15881037453403,106.28466297328721,26.907491052375207,30.976617847008661,34.363171161503594,11.7585218745494,22.604649286954206,4.0660489818651318,0.66207185760988574,3.4039771242552463,50.654543563548664,7.002278981403272,43.652264582145385,1.1893162986858581,0.46822062526511632,0.7210956734207421,17.181930892622105,6.6501147944210297,10.531816098201077,90922.183206169284,16394.531610782113,14178.816430056388,4530.4553331759607,126025.98658018379,30257.691415040539,60664.491791128785,3928.164963957463,12466.36664682465,4627.4040925819027,9551.4123374744886,3418.9797014921573,1111.4756316838032,42232.240173072052,83793.746407111714,100,180,0.96576369114215399,0.78686697302109287,0.62098063580639506,1.5775195043676813,0.58012980546013981,0.93147849364170043,7.7115235080653664,9.6998428933260179,1.6103561727032225,0.63390658386872434,501.33595892910256,1215.8893067870033,7.6922789232640926E-2,0.18656071883609932,0.26348350806874021,0.21648526982910338,274.44347334782123,1.5116082991018402,0.8808114646720997]
["MED-1-5-M12-SW13-AW13",1,190,157.50187842998992,87.797672547745847,27.713634611713154,38.920419629363295,26.653651693378819,30.645141919594529,9.5570485716568268,10.998101186107851,103.55956595169144,139.36593949152802,0.96175229510003235,0.78737953525235049,32.663822381571094,242.92550544321949,20.555149757764678,245.29955097773578,28.082286806904261,31.724769721299793,157.50187842998992,87.797672547745847,27.310462122305452,30.645141919594529,29.143922370085502,10.656931944544137,18.486990425541368,3.461068279826188,0.62806449440807555,2.8330037854181125,43.27322012070529,6.7470539722161167,36.526166148489182,0.95188685583014165,0.40250137598117774,0.54938547984896358,13.885899747005721,5.8452606983106516,8.0406390486950716,80202.208619819736,14194.410811132815,12444.668389112743,4224.7899118338473,111066.07773189915,29930.314144520748,50271.894475298941,3863.1798889457123,10331.230922187098,4529.7840201485869,7914.8843689641617,3303.6063552991304,921.18355653471758,41626.884408914193,69439.193322984938,100,190,0.96175229510003235,0.78737953525235049,0.65751321180416267,1.5873534621972865,0.54505034711416545,0.7335049446922528,7.9681432128497756,10.672311637129779,1.5208819869278085,0.62997941152675263,512.75130385606792,1012.9373928876004,4.8299201411975419E-2,9.541480789785127E-2,0.1437140093098267,0.2273626659042452,245.29955097773575,1.2785552918064185,0.88518489034295511]
["MED-1-5-M12-SW13-AW13",1,200,147.77561864906599,72.765882795244735,28.240557348758433,38.966212304343621,27.068230506902719,30.715733561488367,9.3103080759502976,9.1147376643127949,102.24112063386693,115.71530759556367,0.95848782913955999,0.78826582685493496,32.614759709712359,217.9564282294306,18.425045740263084,220.54150144431071,28.271694607886442,31.77940036147557,147.77561864906599,72.765882795244735,27.663239692185471,30.715733561488367,24.758049533425069,9.7262597809239537,15.031789752501121,2.9129690562128139,0.59681451658258022,2.3161545396302334,36.485144906558283,6.5023630568216237,29.982781849736661,0.77121075667974182,0.34786643951868723,0.42334431716105453,11.343143570341287,5.151298257705994,6.1918453126352961,71083.826803115036,12337.96873620835,10969.809109268599,3950.3157163651458,98341.920364957128,29473.934817504516,41609.891985610564,3784.7665631987952,8553.2021730095512,4419.6345753213573,6550.1745339472373,3186.3434448546336,763.97227151051334,40864.679400879308,57477.240964077857,100,200,0.95848782913955999,0.78826582685493496,0.69186731592487327,1.5902412387570963,0.51120560316933461,0.57857653797781838,8.2261875517804661,11.722928028996234,1.4453638392546722,0.62883540913678093,519.91167877550754,841.5931274978451,3.006559196298288E-2,4.8667873031423878E-2,7.8733464994406754E-2,0.23817874119053101,220.54150144431071,1.0897821411471531,0.88962328698179816]
[]
[]
["ELAPSED TIME","00:00:07","Distribution Example CP"]
[]
["ELAPSED TIME","00:00:08","For All CP"]

{"sheet":"Yields","index":8,"n_rows":22,"n_cols":76,"rows_kept":22,"cut":false,"hidden":false,"merged":[]}
["YIELDS",null,"Distribution Example CP",null,"12:52 18 Dec 2024",null,"Distribution Example CP",null,null,null,null,null,null,null,null,null,null,null,null,null,null,null,null,null,null,null,null,null,null,null,null,null,null,null,null,null,null,null,null,null,null,null,null,null,null,null,null,null,null,null,null,null,null,null,null,null,null,"Taper",null,"Vol/tree",null,"Volume Mai",null,"Spacing (m)",null,"Trees/Vol"]
["stID","stWT","Age","C_Den","D_Den","C_AvDbh","D_AvDbh","C_AvHt","D_AvHt","C_Ba","D_Ba","C_Vol","D_Vol","C_Slndr","D_Slndr","stQMD","StVol","stBa","stDensity","stavHt","stavDbh","C_Tden","D_Tden","C_TopHt","D_TopHt","stDenDead","C_DenDead","D_DenDead","stBaDead","C_BaDead","D_BaDead","stVolDead","C_VolDead","D_VolDead","stBaSurvGrowth","C_BaSurvGrowth","D_BaSurvGrowth","stVolSurvGrowth","C_VolSurvGrowth","D_VolSurvGrowth","stBWood","stBBark","stBBranch","stBFoliage","stBTotal","C_stBWood","D_stBWood","C_stBBark","D_stBBark","C_stBBranch","D_stBBranch","C_stBFoliage","D_stBFoliage","C_stBTotal","D_stBTotal","stCC","Age2","C_Tapr","D_Tapr","C_VPT","D_VPT","C_Mai","D_Mai","C_space","D_space","C_TPM","D_TPM","C_netvalue","D_netvalue","C_NPV","D_NPV","stNPV","SF","st_TDen","stMAI","stSlndr"]
["MED-1-5-M12-SW13-AW13",1,13,901.875,4425,1.1509388513863086,4.9031084567308429,2.0030419021844863,7.3112443923950199,0.13631136417957379,9.1951462767501546,0.15153070345477454,33.160982979686807,1.7403547545308924,1.4911447415278687,4.7227347127846109,33.312513683141582,9.3314576409297274,5326.875,6.3528189427736734,4.2256333890991904,975,4425,2.6373444259166718,10.044910430908203,0,0,0,0,0,0,0,0,0,0,0,0,0,0,0,13771.155127332135,2760.6390265678183,3798.0191085725455,7186.2318940698042,27516.045156542303,104.3871418369698,13666.767985495168,33.38595345850969,2727.2530731093088,36.266671571346052,3761.7524370012006,66.891887283532171,7119.3400067862731,240.9316541503577,27275.113502391941,100,{"$f":"C3","v":13},{"$f":"H3/(F3)","v":1.7403547545308924},{"$f":"I3/(G3)","v":1.4911447415278687},{"$f":"L3/D3","v":1.6801741200806602E-4},{"$f":"M3/E3","v":7.4940074530365662E-3},{"$f":"IF(L3 > 0, L3/$C3,0)","v":1.165620795805958E-2},{"$f":"IF(M3 > 0, M3/$C3,0)","v":2.550844844591293},{"$f":"SQRT(10000/D3)","v":3.3298665270564656},{"$f":"SQRT(10000/E3)","v":1.5032920560056577},{"$f":"D3/L3","v":5951.7640942594271},{"$f":"E3/M3","v":133.43995269110664},{"$f":"(35 - (8.9465 - 2.6288 * LN($BH3)) - 20) * $L3","v":-2.5448922794837712},{"$f":"(35 - (8.9465 - 2.6288 * LN($BI3)) - 20) * $M3","v":-225.8571763919156},{"$f":"$BP3/(1+0.05)^$C3","v":-1.3496107109026163},{"$f":"$BQ3/(1+0.05)^$C3","v":-119.77688283709324},{"$f":"SUM(BR3:BS3)","v":-121.12649354799585},{"$f":"SQRT(10000/S3)/T3","v":0.21567373980942248},{"$f":"V3+W3","v":5400},{"$f":"Q3/C3","v":2.5625010525493526},{"$f":"IF(T3=0, 0,T3/U3)","v":1.503400403632259}]
["MED-1-5-M12-SW13-AW13",1,20,860.54896836233434,3294.2850460762229,4.9299386362783775,8.4889261025906126,4.2624619300370803,11.070309498854648,1.6594801713554115,20.032597724065855,3.324858449832139,104.80576000882725,0.86460750214425042,1.3040883340327654,8.1532131781803692,108.13061845865938,21.692077895421264,4154.8340144385575,9.6602685244727535,7.7517888350352129,860.54896836233434,3294.2850460762229,5.1140215092177632,14.114350914377191,1245.0837421849674,114.36878826119022,1130.7149539237771,3.9644613977143601,0.10689977662496268,3.8575616210893977,17.432760652104331,0.18614544746797396,17.24661520463636,15.784883618851602,1.5989876933108544,14.185895925540748,89.267561133744977,3.3019915382585117,85.965569595486443,46903.589391959416,10819.056180752405,7289.3855527159194,4355.8371826382108,69367.868308065968,1924.7213450328079,44978.868046926626,398.84909217148663,10420.207088580913,682.69479291198661,6606.6907598039306,1435.9181034478192,2919.919079190392,4442.1833335640995,64925.684974501841,100,{"$f":"C4","v":20},{"$f":"H4/(F4)","v":0.86460750214425042},{"$f":"I4/(G4)","v":1.3040883340327654},{"$f":"L4/D4","v":3.8636481735135919E-3},{"$f":"M4/E4","v":3.181441755735738E-2},{"$f":"IF(L4 > 0, L4/$C4,0)","v":0.16624292249160694},{"$f":"IF(M4 > 0, M4/$C4,0)","v":5.2402880004413621},{"$f":"SQRT(10000/D4)","v":3.4088838654639941},{"$f":"SQRT(10000/E4)","v":1.7422858622981516},{"$f":"D4/L4","v":258.82273827500251},{"$f":"E4/M4","v":31.432290036337339},{"$f":"(35 - (8.9465 - 2.6288 * LN($BH4)) - 20) * $L4","v":-28.435818046268221},{"$f":"(35 - (8.9465 - 2.6288 * LN($BI4)) - 20) * $M4","v":-315.48320842256345},{"$f":"$BP4/(1+0.05)^$C4","v":-10.717160758528768},{"$f":"$BQ4/(1+0.05)^$C4","v":-118.90230327749501},{"$f":"SUM(BR4:BS4)","v":-129.61946403602377},{"$f":"SQRT(10000/S4)/T4","v":0.16059571830117486},{"$f":"V4+W4","v":4154.8340144385575},{"$f":"Q4/C4","v":5.4065309229329692},{"$f":"IF(T4=0, 0,T4/U4)","v":1.2461986168678796}]
["MED-1-5-M12-SW13-AW13",1,30,736.48602581062141,2000.0971181907576,8.1913913160013081,13.327800658828631,7.4253187956931956,15.161440626093901,3.8931224745868565,29.08023375665913,12.991000671105827,201.50247834103646,0.90647833917888365,1.1375800864826582,12.386035282672436,214.49347901214219,32.973356231245994,2736.5831440013794,13.079448111250093,11.945458699978378,736.48602581062141,2000.0971181907576,8.3183940986656939,18.368263657995513,1418.2508704371794,124.06294255171316,1294.1879278854663,8.9242192807753788,0.4543994105724834,8.4698198702028975,48.66223625274916,1.2759096099312119,47.386326642817963,19.592824647130911,2.6465907905679003,16.946233856563012,150.75488563722692,10.774758694345394,139.98012694288153,85202.577652105581,18849.764337799181,13519.421733044133,6219.7487579412991,123791.51248089017,6013.4144562477541,79189.163195857822,1087.2735591926973,17762.490778606472,1668.5185663833463,11850.903166660784,2581.7209038142637,3638.0278541270318,11350.927485638062,112440.58499525212,100,30,0.90647833917888365,1.1375800864826582,1.7639167907913988E-2,0.10074634701904427,0.43303335570352758,6.7167492780345492,3.6848324445590142,2.2360136887578443,56.692016608750578,9.925918205361512,-59.247156258683383,4.032351473532783,-13.708455855249118,0.93299519602970538,-12.775460659219412,0.14615250282175685,2736.583144001379,7.1497826337380728,1.094930587410073]
["MED-1-5-M12-SW13-AW13",1,40,638.79520357578076,1437.8116625001257,10.564867345784338,17.116313526655798,10.249942898950287,18.231696338448454,5.615397861713296,34.276070312333573,25.397221880395708,279.96417963254567,0.97019134869121537,1.0651648972225025,15.639322189226318,305.36140151294137,39.891468174046885,2076.6068660759065,15.776390090275076,15.100991096014958,638.79520357578076,1437.8116625001257,10.981968108695256,21.471151511424313,659.97627792547121,97.690822234840297,562.2854556906309,8.6872676310836887,0.69477982707643382,7.9924878040072551,58.345168115764167,2.7938172529479819,55.551350862816186,15.259442492829319,2.3830218199870652,12.876420672842258,146.14210046295869,14.986881687079631,131.15521877587906,114737.23234798182,24727.259998859219,18301.420562691877,7171.9225385761683,164937.83544810914,10043.787059755879,104693.44528822595,1693.3856769564318,23033.874321902782,2457.4951470188976,15843.925415672984,3252.1782533271962,3919.7442852489739,17446.846137058408,147490.98931105074,100,40,0.97019134869121537,1.0651648972225025,3.9758003407398497E-2,0.19471547417116683,0.63493054700989271,6.9991044908136413,3.9565729427470493,2.6372360212261516,25.152168476697494,5.1356986611189352,-61.568785635180681,490.5576200983374,-8.7455801639487838,69.68159185446882,60.936011690520033,0.13909618572655791,2076.6068660759065,7.6340350378235344,1.0447254746371151]
["MED-1-5-M12-SW13-AW13",1,50,559.3886635787195,1135.5984711449833,12.498038187429371,20.155532831745372,12.679093186580852,20.505818680623765,6.8827143998147777,37.575238463925011,38.046285086414933,341.20493236417542,1.0144866735431797,1.0173791410925483,18.274545591820782,379.25121745059045,44.457952863739813,1694.9871347237031,17.922801131629896,17.628365747292314,559.3886635787195,1135.5984711449833,13.517316229164113,23.825056489530652,381.61973135220376,79.406539997061401,302.21319135514238,7.8926386624581433,0.84235942507013783,7.050279237388005,61.718771808914141,4.2869446752411902,57.43182713367294,12.239467409729455,2.0820057104220808,10.157461699307374,133.32346887035828,16.714497513664647,116.60897135669367,137711.4721899401,29137.394808603993,21986.545502453278,7687.4023956272122,196522.81489662451,13567.409083787028,124144.06310615306,2183.8626964199893,26953.532112184006,3054.1275275819535,18932.417974871321,3644.2574857059622,4043.1449099212523,22449.656793494927,174073.15810312959,100,50,1.0144866735431797,1.0173791410925483,6.8014043836733748E-2,0.30046265562523233,0.76092570172829865,6.8240986472835088,4.2280797423539784,2.9674786321065523,14.702845818144244,3.3282006308541119,-38.534128245556879,986.95139430313111,-3.3603195986442413,86.06583992382059,82.705520325176352,0.13552234597453011,1694.9871347237026,7.5850243490118086,1.0167023641645743]
["MED-1-5-M12-SW13-AW13",1,60,493.53611017666151,942.03535888785734,14.153321842167925,22.670363408952742,14.742669097235165,22.211764128063621,7.7896540370149765,39.561615393922096,49.611006292058619,386.44170577654046,1.0416402072700246,0.97977097796729562,20.493137938915261,436.05271206859913,47.351269430937037,1435.5714690645191,19.643958771457413,19.742283786540707,493.53611017666151,942.03535888785734,15.703407449861196,25.671369016538591,259.41566565918396,65.852553402058078,193.56311225712585,7.3513474315750091,0.92688726409136557,6.4244601674836437,64.187420121295375,5.554483310525919,58.632936810769458,10.08915026861353,1.8111639119197314,8.2779863566937966,119.18876253839052,16.908116589184282,102.28064594920625,155069.67765160248,32355.447339704489,24745.656049867543,7928.7584803587797,220099.53952153338,16503.427798053373,138566.24985354909,2566.6553797360771,29788.791959968425,3492.2586477618688,21253.397402105664,3859.2033516081369,4069.5551287506396,26421.545177159449,193677.9943443739,100,60,1.0416402072700246,0.97977097796729562,0.10052153281003154,0.41021995844483328,0.82685010486764365,6.4406950962756744,4.5013266844742761,3.2581149145702115,9.9481173042777673,2.4377165942658072,0.70143685367198794,1434.1148469383829,3.7551789336422919E-2,76.776089443469758,76.813641232806177,0.13435646748510174,1435.5714690645189,7.267545201143319,0.99501957239869443]
["MED-1-5-M12-SW13-AW13",1,70,438.34300109318758,785.54726927731019,15.626006820233064,24.966514524890705,16.5016396419519,23.68419565289436,8.4359972204718705,40.108958357233988,59.683461170613512,414.42157004204,1.0560368897692427,0.94863845048463136,22.472731978067202,474.1050312126535,48.544955577705856,1223.8902703704978,21.111723893311424,21.621160551487332,438.34300109318758,785.54726927731019,17.520202034169969,27.157028908033951,211.68076690775374,55.19310908347385,156.48765782427989,7.3687071091723038,0.96612304162051088,6.4025840675517909,68.765797093005745,6.5224667403259184,62.243330352679827,8.4377260823761802,1.5936236318785508,6.8441024504976298,105.28824553465127,16.401377759905554,88.886867774745681,166280.54171816271,34286.771204979901,26519.849030713591,7940.4605465259883,235027.62250038231,18930.726410259758,147349.81530790293,2864.5010104194994,31422.270194560413,3813.1240789911963,22706.724951722394,3963.7648916780572,3976.6956548479343,29572.116391348511,205455.50610903377,100,70,1.0560368897692427,0.94863845048463136,0.13615698442034752,0.52755777564257922,0.85262087386590735,5.9203081434577145,4.7763150075734409,3.5679095690177971,7.3444634827749491,1.8955269852329892,48.451794907966381,1812.0129646091045,1.5924248101839373,59.553921721567797,61.146346531751732,0.13539575909903231,1223.8902703704978,6.7729290173236212,0.9764380521127547]
["MED-1-5-M12-SW13-AW13",1,80,391.82886287485269,659.20744975307139,16.979162030408474,27.069937605831903,18.015331344902457,24.956197053730662,8.9068036872259917,39.647407230705895,68.341177835848612,428.12061734532136,1.0610259394803039,0.92191557354584153,24.252675119692647,496.46179518117009,48.55421091793189,1051.0363126279237,22.368625639326087,23.308072224266173,391.82886287485269,659.20744975307139,19.050207775360516,28.364190170420706,172.8536018256558,46.514138218334971,126.33946360732084,7.2096579271477852,0.9736421086091841,6.2360158185386023,71.251877811804746,7.1973817613848379,64.054496050419928,7.1168013664241663,1.4285057836995838,5.6882955827245825,92.297858108584009,15.680392996300416,76.617465112283583,172569.01673638995,35210.823788746791,27505.873238342861,7814.3058387598867,243100.01960223948,20977.501375857075,151591.51536053282,3101.824442002353,32108.999346744422,4053.7401428782227,23452.133095464651,4002.759281791889,3811.5465569679986,32135.825242529532,210964.19435970992,100,80,1.0610259394803039,0.92191557354584153,0.17441588486980933,0.64944748046413692,0.85426472294810762,5.351507716816517,5.0518656004874085,3.8948339472184501,5.7334227369625088,1.5397703895707404,99.969010490426655,2105.8492657636557,2.0170723114285662,42.489669800430953,44.506742111859516,0.13789605388401779,1051.036312627924,6.2057724397646261,0.95969436786101847]
["MED-1-5-M12-SW13-AW13",1,90,352.3972490515298,549.0174870861357,18.254080756352753,29.145053626330906,19.329389841777179,26.156050292365318,9.2628538529030227,38.332880473415536,75.803400670367736,429.4885781658686,1.0589078737942035,0.89744388971495348,25.928461517551028,505.29197883623635,47.595734326318535,901.41473613766539,23.487249498954821,24.887358777320806,352.3972490515298,549.0174870861357,20.350512668839603,29.378540822968979,149.62123891261899,39.43161382332292,110.18962508929607,7.2257449194894789,0.96201570114346624,6.2637292183460138,74.349633612834978,7.6363288136901426,66.713304799144836,6.1780561889950096,1.3043352224627933,4.8737209665322165,82.00470728496704,14.941483257683965,67.063224027283056,174732.66120457198,35291.292619561958,27836.297929212516,7587.3921636496461,245447.64391699623,22758.355678902146,151974.30552566986,3297.9323623676569,31993.36025719429,4241.2308541452776,23595.067075067225,4003.979546929454,3583.4126167201912,34301.498442344535,211146.14547465165,100,90,1.0589078737942035,0.89744388971495348,0.21510781050190114,0.78228578919287839,0.84226000744853036,4.7720953129540957,5.3270128604551923,4.2678280275609817,4.6488316610482254,1.2783052099562586,152.67138710923149,2322.6902113571255,1.8911271739738438,28.770961334606962,30.662088508580805,0.14180956081749013,901.4147361376655,5.614355320402626,0.94374215074836032]
["MED-1-5-M12-SW13-AW13",1,100,318.73048585186467,457.57859102818537,19.483901328207878,31.271165862211134,20.480200654922154,27.204038748975499,9.5502936692520652,36.894326819361289,82.350749924880759,425.72704997603205,1.0511344884133591,0.8699400229861447,27.599768320681829,508.07779990091285,46.444620488613346,776.30907688004982,24.443421558822475,26.431649407133268,318.73048585186467,457.57859102818537,21.522546292312864,30.240325488987246,125.10520873618428,33.666763199665091,91.438445536519225,7.1118924775045356,0.94103968330832499,6.1708527941962101,76.448165483536087,7.9106034285201012,68.537562055015982,5.8750432693156522,1.2163911613502705,4.6586521079653815,78.094071733358547,14.315826911859061,63.778244821499456,175993.22440645494,35192.687712577244,28019.114499832958,7341.0742336942012,246546.10085255958,24379.346833005926,151613.87757344911,3468.9244537298828,31723.763258847372,4396.6893911891721,23622.425108643791,3985.7285533249037,3355.3456803692966,36230.689231249889,210315.41162130958,100,100,1.0511344884133591,0.8699400229861447,0.25837111158282688,0.93039110291287341,0.82350749924880762,4.2572704997603203,5.6012917966780762,4.6748443084127791,3.8704017406351041,1.0748168129179165,205.53031593485375,2496.39166385003,1.5629532317863759,18.983785438522339,20.546738670308716,0.146831985046217,776.30907688005004,5.0807779990091282,0.92477851768969754]
["MED-1-5-M12-SW13-AW13",1,110,289.75891420104193,386.87941606425665,20.698421654712909,33.06014704609138,21.494271195329937,27.975368408283469,9.8058596156686768,34.978776395568389,88.273023412851728,412.49481789249137,1.0384497694506971,0.84619612759982954,29.029615638981809,500.76784130534321,44.784636011237062,676.63833026529869,25.199948206296831,27.766447344431157,289.75891420104193,386.87941606425665,22.514929859735084,30.959135874754384,99.670746614751266,28.971571650822657,70.699174963928613,6.8539843027138501,0.91710512597832916,5.9368791767355198,77.043763041694092,8.0796318945222669,68.964131147171827,5.1183291379509352,1.1617540761351188,3.9565750618158151,68.707910613754777,13.871619812040073,54.836290801714725,173890.23771926004,34434.443124123798,27654.214571331871,7072.235471996778,243051.13088671275,25941.839342331059,147948.39837692914,3628.825716543065,30805.617407580721,4537.308237168897,23116.906334162974,3960.594140607282,3111.6413313894982,38068.567436650301,204982.56345006239,100,110,1.0384497694506971,0.84619612759982954,0.30464299487126639,1.0662102990353466,0.80248203102592475,3.7499528899317398,5.8746445880063884,5.0840778042054788,3.2825307551305163,0.93790127604727658,258.54018233429684,2566.5567428394747,1.2069941163101265,11.981962957610186,13.188957073920312,0.15255345706322107,676.63833026529858,4.5524349209576656,0.907568328555037]
["MED-1-5-M12-SW13-AW13",1,120,264.74598952264262,326.10327346273783,21.882445483296287,34.592885226855195,22.394270423954417,28.613270588238162,10.019582368460318,32.353951085306321,93.491141307205567,388.23856680257398,1.0233897505216603,0.82714322325519896,30.217884057509863,481.72970810977955,42.373533453766626,590.84926298538062,25.826679395730384,28.897628994878328,264.74598952264262,326.10327346273783,23.412071466749076,31.571433726418519,85.7890672799182,25.012924678399322,60.776142601518885,6.7896559819238531,0.88862879437639586,5.9010271875474576,78.43072375070696,8.139212191195254,70.291511559511719,4.312391022481088,1.0926233120130551,3.2197677104680316,58.482007306334737,13.239567660393526,45.242439645941232,167441.85899022021,32819.256328270436,26590.958856969821,6754.555946742089,233606.63012220259,27388.860978974826,140052.99801124533,3771.8616564758099,29047.394671794616,4657.8162174168474,21933.142639552978,3927.1850436571017,2827.3709030849882,39745.723896524585,193860.90622567802,100,120,1.0233897505216603,0.82714322325519896,0.35313525041787142,1.1905386986154742,0.7790928442267131,3.2353213900214497,6.1458973883479819,5.5376106964824379,2.8317762070387524,0.8399558965726529,310.12611869588841,2528.201087484661,0.88883767665032765,7.2459565487558208,8.1347942254061483,0.15929167519419599,590.84926298538039,4.0144142342481626,0.89373004962821612]
["MED-1-5-M12-SW13-AW13",1,130,243.07708357233889,273.33635905574016,22.99726328534954,35.871360821591445,23.198774812698293,29.145151632283437,10.162353686687979,29.196613170916073,97.752868390513811,355.3426692613632,1.0087624133727742,0.81249082735496858,31.151440565428977,453.0955376518769,39.358966857604052,516.41344262807888,26.346177369005193,29.811491297650132,243.07708357233889,273.33635905574016,24.199126773886452,32.068340917368403,74.435820357301537,21.668905950303859,52.766914406997692,6.6212027883168254,0.85487273147703124,5.7663300568397933,78.10790499002168,8.0909310739047573,70.016973916116925,3.5502359227350833,0.98928415787568436,2.5609517648593991,48.685937603680095,12.249363998771669,36.436573604908432,157291.0731795363,30494.483225073654,24934.55366931848,6394.6432477373273,219114.75332166586,28592.250205240693,128698.82297429557,3883.782090268201,26610.701134805455,4743.6379282358057,20190.91574108267,3878.6341131883169,2516.0091345490118,41098.304336933012,178016.44898473279,100,130,1.0087624133727742,0.81249082735496858,0.40214761076571376,1.3000197649845036,0.75194514146549085,2.7334051481643322,6.4139857610932758,6.0485503113165366,2.4866491139806564,0.76921907415147661,357.66125136397932,2396.1620189665709,0.62930765210155915,4.2160650292984183,4.8453726813999776,0.16702582260861037,516.41344262807911,3.4853502896298223,0.88375912180823746]
["MED-1-5-M12-SW13-AW13",1,140,224.20337323264448,227.87108212040977,24.015014805803734,36.871804023195253,23.922219495649717,29.580425930985925,10.220761466512059,25.737065235946478,100.935173515725,316.87317518117561,0.99613594616099965,0.80225057370063912,31.823415776767273,417.80834869690057,35.957826702458526,452.0744553530543,26.774275408151542,30.495563389936933,224.20337323264448,227.87108212040977,24.869395791416377,32.421855264537875,64.338987275024621,18.873710339694274,45.465276935330344,6.2970108305398433,0.81684660044314339,5.4801642300966993,75.54897391974275,7.9518536539869711,67.597120265755791,2.8492837304863059,0.86829349010648693,1.9809902403798185,39.600793419971026,11.045844736675189,28.554948683295827,144495.96924078203,27683.252110993006,22855.983047888236,6006.6742005664728,201041.87860022963,29483.132479257172,115012.83676152489,3957.4501044987542,23725.80200649425,4787.902626030449,18068.080421857783,3812.0521520096499,2194.6220485568206,42040.537361796021,159001.34123843367,100,140,0.99613594616099965,0.80225057370063912,0.45019471411337636,1.3905809031693459,0.72096552511232137,2.2633798227226829,6.6784999764267781,6.6245349031963938,2.221261086926404,0.71912392707310124,399.25111760500823,2192.8485866112392,0.43126505660984421,2.368682085386979,2.7999471419968232,0.17566178427867238,452.07445535305425,2.9843453478350042,0.87797280757851615]
["MED-1-5-M12-SW13-AW13",1,150,207.64252818540774,189.06501620345125,24.936727671632301,37.660342153806255,24.575885416948505,29.928083463698361,10.205163203836157,22.278557295981852,103.1289668611021,276.81869740084807,0.98552968699681132,0.79468432181181314,32.288859999699412,379.94766426195031,32.483720499817998,396.70754438885899,27.126664762452826,31.000616327807407,207.64252818540774,189.06501620345125,25.460552996881592,32.559291678845675,55.366910964195242,16.56084504723675,38.806065916958495,5.8437951959160657,0.77707446695306648,5.0667207289629994,71.06251974802575,7.7528623337511107,63.309657414274618,2.3308661876440731,0.75571729509723895,1.5751488925468347,32.646204092082399,9.8716414432379693,22.77456264884443,130656.16680421679,24708.085623776977,20610.968514282955,5615.7092764810232,181590.93021875786,30081.840185442623,100574.32661877421,3996.4097527774575,20711.675870999519,4795.3660894438808,15815.602424839075,3730.8751543302901,1884.8341221507335,42604.49118199425,138986.43903676362,100,150,0.98552968699681132,0.79468432181181314,0.49666591792321269,1.4641455249603967,0.68752644574068067,1.8454579826723205,6.9397183674771306,7.2726788774114244,2.0134258541062313,0.68299221829541068,434.56140808454973,1953.1738610769673,0.28817499546376807,1.2952274594210957,1.5834024548848638,0.18508378392869221,396.70754438885899,2.5329844284130019,0.87503630494340645]
["MED-1-5-M12-SW13-AW13",1,160,192.98941265459734,156.27407146540847,25.756386749948028,38.230865643930059,25.168925577504215,30.197301401980351,10.117644256598735,18.970309711362386,104.35345055468491,237.41676036583996,0.97719163102545825,0.78986705881128272,32.563798252404503,341.77021092052502,29.087953967961131,349.26348412000601,27.418816558604053,31.337953947227799,192.98941265459734,156.27407146540847,26.004788876588545,32.394798023908791,47.444060268853164,14.653115530810433,32.790944738042732,5.3005776378107532,0.73744323322504146,4.5631344045857114,65.138737610313271,7.5186519346862317,57.620085675627038,1.8732244757473673,0.64523209097701417,1.2279923847703518,26.505152531364118,8.680185352186875,17.824967179177239,116622.32116624758,21739.552307137084,18337.577847323559,5232.2082871460634,161931.65960785432,30382.630035058406,86239.691131189174,4000.8283255688939,17738.723981568193,4766.8449643840868,13570.732882939468,3635.932888890005,1596.2753982560596,42786.236213901393,119145.42339395294,100,160,0.97719163102545825,0.78986705881128272,0.54072111583370341,1.5192332172544218,0.65220906596678074,1.4838547522864998,7.1983549492366468,7.9993838416774308,1.849382187448263,0.6582267874626998,463.03483852308858,1698.2134219311129,0.18850627742420276,0.69136026883231716,0.87986654625651994,0.1951527623362147,349.26348412000584,2.1360638182532812,0.8749395893802302]
["MED-1-5-M12-SW13-AW13",1,170,179.9173322490835,128.88931226024141,26.482592163010928,38.599478856559692,25.708919689402833,30.398442443571568,9.9706929933331203,15.935668154857868,104.73093298665243,200.54376286773652,0.97078562140572078,0.78753504824600973,32.682475846879264,305.27469585438882,25.906361148190982,308.80664450932483,27.666226545846833,31.53992243888074,179.9173322490835,128.88931226024141,26.485628252845295,31.915117722769168,40.456839610681016,13.072080405513894,27.384759205167114,4.6935794544127258,0.6986451141040495,3.9949343403086761,58.141651225350458,7.2620966910679829,50.879554534282477,1.4869833159668677,0.54787370643352462,0.93910960953334344,21.281685966051324,7.5868160425940605,13.69486992345727,103159.52633478906,18926.916976642136,16158.712841013874,4867.329264370911,143112.48541681594,30422.802627239384,72736.723707549696,3975.785598076448,14951.131378565684,4708.3110810723656,11450.401759941511,3530.6514699793684,1336.6777943915424,42637.550776367571,100474.93464044839,100,170,0.97078562140572078,0.78753504824600973,0.58210585760386591,1.5559378768568262,0.6160643116861908,1.1796691933396266,7.4552720954308729,8.8082888260969217,1.7179005964934284,0.64269918155094674,485.01403365440109,1447.0507870942013,0.12121977205137653,0.36166204354267012,0.48288181559404664,0.20568695692193018,308.80664450932488,1.7957335050258165,0.87718118519344801]
["MED-1-5-M12-SW13-AW13",1,180,168.15881037453403,106.28466297328721,27.130916479995697,38.816550268893423,26.202054043790142,30.543461413205257,9.7799893819378649,13.269222014355627,104.42336498282516,167.66612885550609,0.96576369114215399,0.78686697302109287,32.700669272593821,272.08949383833124,23.049211396293487,274.44347334782123,27.883365730525853,31.656451861586536,168.15881037453403,106.28466297328721,26.907491052375207,30.976617847008661,34.363171161503594,11.7585218745494,22.604649286954206,4.0660489818651318,0.66207185760988574,3.4039771242552463,50.654543563548664,7.002278981403272,43.652264582145385,1.1893162986858581,0.46822062526511632,0.7210956734207421,17.181930892622105,6.6501147944210297,10.531816098201077,90922.183206169284,16394.531610782113,14178.816430056388,4530.4553331759607,126025.98658018379,30257.691415040539,60664.491791128785,3928.164963957463,12466.36664682465,4627.4040925819027,9551.4123374744886,3418.9797014921573,1111.4756316838032,42232.240173072052,83793.746407111714,100,180,0.96576369114215399,0.78686697302109287,0.62098063580639506,1.5775195043676813,0.58012980546013981,0.93147849364170043,7.7115235080653664,9.6998428933260179,1.6103561727032225,0.63390658386872434,501.33595892910256,1215.8893067870033,7.6922789232640926E-2,0.18656071883609932,0.26348350806874021,0.21648526982910338,274.44347334782123,1.5116082991018402,0.8808114646720997]
["MED-1-5-M12-SW13-AW13",1,190,157.50187842998992,87.797672547745847,27.713634611713154,38.920419629363295,26.653651693378819,30.645141919594529,9.5570485716568268,10.998101186107851,103.55956595169144,139.36593949152802,0.96175229510003235,0.78737953525235049,32.663822381571094,242.92550544321949,20.555149757764678,245.29955097773578,28.082286806904261,31.724769721299793,157.50187842998992,87.797672547745847,27.310462122305452,30.645141919594529,29.143922370085502,10.656931944544137,18.486990425541368,3.461068279826188,0.62806449440807555,2.8330037854181125,43.27322012070529,6.7470539722161167,36.526166148489182,0.95188685583014165,0.40250137598117774,0.54938547984896358,13.885899747005721,5.8452606983106516,8.0406390486950716,80202.208619819736,14194.410811132815,12444.668389112743,4224.7899118338473,111066.07773189915,29930.314144520748,50271.894475298941,3863.1798889457123,10331.230922187098,4529.7840201485869,7914.8843689641617,3303.6063552991304,921.18355653471758,41626.884408914193,69439.193322984938,100,190,0.96175229510003235,0.78737953525235049,0.65751321180416267,1.5873534621972865,0.54505034711416545,0.7335049446922528,7.9681432128497756,10.672311637129779,1.5208819869278085,0.62997941152675263,512.75130385606792,1012.9373928876004,4.8299201411975419E-2,9.541480789785127E-2,0.1437140093098267,0.2273626659042452,245.29955097773575,1.2785552918064185,0.88518489034295511]
["MED-1-5-M12-SW13-AW13",1,200,147.77561864906599,72.765882795244735,28.240557348758433,38.966212304343621,27.068230506902719,30.715733561488367,9.3103080759502976,9.1147376643127949,102.24112063386693,115.71530759556367,0.95848782913955999,0.78826582685493496,32.614759709712359,217.9564282294306,18.425045740263084,220.54150144431071,28.271694607886442,31.77940036147557,147.77561864906599,72.765882795244735,27.663239692185471,30.715733561488367,24.758049533425069,9.7262597809239537,15.031789752501121,2.9129690562128139,0.59681451658258022,2.3161545396302334,36.485144906558283,6.5023630568216237,29.982781849736661,0.77121075667974182,0.34786643951868723,0.42334431716105453,11.343143570341287,5.151298257705994,6.1918453126352961,71083.826803115036,12337.96873620835,10969.809109268599,3950.3157163651458,98341.920364957128,29473.934817504516,41609.891985610564,3784.7665631987952,8553.2021730095512,4419.6345753213573,6550.1745339472373,3186.3434448546336,763.97227151051334,40864.679400879308,57477.240964077857,100,200,0.95848782913955999,0.78826582685493496,0.69186731592487327,1.5902412387570963,0.51120560316933461,0.57857653797781838,8.2261875517804661,11.722928028996234,1.4453638392546722,0.62883540913678093,519.91167877550754,841.5931274978451,3.006559196298288E-2,4.8667873031423878E-2,7.8733464994406754E-2,0.23817874119053101,220.54150144431071,1.0897821411471531,0.88962328698179816]

{"sheet":"YieldTables","index":9,"n_rows":0,"n_cols":0,"rows_kept":0,"cut":false,"hidden":false,"merged":[]}

{"sheet":"Charts","index":10,"n_rows":1,"n_cols":1,"rows_kept":1,"cut":false,"hidden":false,"merged":[]}
["Charts include only utilized trees (except for the st_Tden/stQMD where total density is used)"]

{"sheet":"MyCharts","index":11,"n_rows":19,"n_cols":17,"rows_kept":19,"cut":false,"hidden":false,"merged":[]}
["Charts include only utilized trees except for C_Tden and D_Tden"]
[]
[]
[]
[]
[]
[]
[]
[]
[]
[]
[]
[]
[]
[]
[]
[]
[]
[null,null,null,null,null,null,null,null,null,null,null,null,null,null,null,null," "]

{"sheet":"Graphs","index":12,"n_rows":1,"n_cols":7,"rows_kept":1,"cut":false,"hidden":false,"merged":[]}
["YIELDS",null,"Distribution Example CP",null,"12:52 18 Dec 2024",null,"Distribution Example CP"]

{"sheet":"Stand","index":13,"n_rows":86,"n_cols":61,"rows_kept":86,"cut":false,"hidden":false,"merged":[]}
["STAND","Stand ID","MED-1-5-M12-SW13-AW13","Stand WT",1,null,null,null," "]
[null,"DateRun","2024-12-18T12:52:00","Gap Area PC",0," ",null,null,null,null,null,null,null,null,null,null,null,null,null,null,null,null,null,null,null,null,"This Range of cells is reserved for internal use! DO NOT modify it!"]
[null,"standAge",200,"TopLight",-1,null,null,null,null," "]
[null,"Year",2191,"CMI",6.5]
[null,"Region",1]
[null,"SubRegion",1," "]
[null,"CropPlanID","Distribution Example CP"]
[null,"CropPlansID","Distribution Example CP"]
[]
["YearsToBH","Stand summary","Site","stAvD","stQMD","stmaxD","stAvDIncr","stAvH","stTopH","stTopHIncr","stmaxH","stAvAge","stAvBHAge","stBa","stDen","stNuDen","stTotDen","strelBa","strelDen","strelTotDen","stSF","stVol","stGrVol","stMatDen","stJuvDen","stAvJvHt","stTopD","stDenDead","stBaDead","stVolDead","stBaSurvGrowth","stVolSurvGrowth","stMAI","stMaxMAI","stBWood","stBBark","stBBranch","stBFoliage","stBTotal","stCC"]
[null,"All",null,{"$f":"IF($Q11>0,SUM(trDbh*trpha)/$Q11,0)","v":31.77940036147557},{"$f":"IF($O11>0,200*SQRT(($N11/$O11)/PI()),0)","v":32.614759709712359},{"$f":"IF(ISERROR(trpha),0,MAX(IF(trUtil,trDbh,0)))","v":59.019213080698897},{"$f":"IF(ISERROR(trpha),0,IF(SUM(IF(trUtil*trDbhIncr>0,trpha,0))>0,SUM(IF(trUtil*trDbhIncr>0,trDbhIncr*trpha,0))/SUM(IF(trUtil*trDbhIncr>0,trpha,0)),0))","v":5.9500437593852096E-2},{"$f":"IF($Q11>0,SUM(trHt* trpha)/$Q11,0)","v":28.271694607886442},{"$f":"IF($Q11>0,toptreesav(trList,$B11),0)","v":30.499344569826668},{"$f":"IF($Q11>0,toptreesav(trList,$B11,13),0)","v":3.3491192304108769E-2},{"$f":"IF(ISERROR(trpha),0,MAX(IF(trUtil,trHt,0)))","v":35.044209820452949},{"$f":"IF($O11>0,SUM(IF(trUtil,trAge* trpha),0)/$O11,0)","v":196.2488731472157},{"$f":"IF($O11>0,SUM(IF(trUtil,trBHAge* trpha),0)/$O11,0)","v":191.13956670533619},{"$f":"IF(ISERROR(trpha),0,SUM(IF(trUtil,trBaHa,0)))","v":18.425045740263084},{"$f":"IF(ISERROR(trpha),0,SUM(IF(trUtil,trpha,0)))","v":220.54150144431071},{"$f":"IF(ISERROR(trpha),0,SUM(IF(NOT(trUtil),trpha,0)))","v":0},{"$f":"IF(ISERROR(trpha),0,SUM(trpha))","v":220.54150144431071},{"$f":"SUM(R12:R13)","v":1.0000000000000004},{"$f":"SUM(S12:S13)","v":1},{"$f":"SUM(T12:T13)","v":1},{"$f":"IF($O11>0,SQRT(10000/$O11)/$H11,1)","v":0.23817874119053101},{"$f":"IF(ISERROR(trpha),0,SUM(IF(NAErr<>trVol,trUtil*trpha*trVol*trVRF,0)))","v":217.9564282294306},{"$f":"IF(ISERROR(trpha),0,SUM(IF(NAErr<>trVol,trUtil*trpha*trVol,0)))","v":217.9564282294306},{"$f":"IF(ISERROR(trpha),0,SUM(IF(NOT(trJuv),trpha,0)))","v":220.54150144431071},{"$f":"IF(ISERROR(trpha),0,SUM(IF(trJuv,trpha,0)))","v":0},{"$f":"IF($Y11>0,SUM(IF(trJuv,trHt* trpha),0)/$Y11,0)","v":0},{"$f":"IF($O11>0,toptreesav(trList,$B11,colTrDbh),0)","v":37.210983558230438},{"$f":"IF(COUNT(trpha)=0,0,SUMPRODUCT((trPsurv>0)*trpha*(1/trPsurv-1)))","v":2.3008848465909324},{"$f":"IF(COUNT(trpha)=0,0,SUMPRODUCT((trBaHa>0)*(trPsurv>0)*trBaHa*(1/trPsurv-1)))","v":0.26871894565941207},{"$f":"IF(COUNT(trpha)=0,0,SUMPRODUCT((trPsurv>0)*(trVol>0)*trUtil*trVol*(trpha/trPsurv-trpha)))","v":3.3669045323996407},{"$f":"IF(AD11=0,0,$N11-SUMPRODUCT(trUtil*(trHtIncr>0)*trpha*PI()*((trDbh-trDbhIncr)/200)^2))","v":6.9972868081205064E-2},{"$f":"IF(COUNT(trpha)=0,0,SUMPRODUCT(trUtil*(trHtIncr>0)*trpha*trVolSurvGrth))","v":1.0338320404262826},{"$f":"W11/nwsStandAge","v":1.0897821411471531},0,{"$f":"IF(COUNT(trpha)=0,0,SUMPRODUCT(trUtil*trpha*trBWood))","v":71083.826803115036},{"$f":"IF(COUNT(trpha)=0,0,SUMPRODUCT(trUtil*trpha*trBBark))","v":12337.96873620835},{"$f":"IF(COUNT(trpha)=0,0,SUMPRODUCT(trUtil*trpha*trBBranch))","v":10969.809109268599},{"$f":"IF(COUNT(trpha)=0,0,SUMPRODUCT(trUtil*trpha*trBFoliage))","v":3950.3157163651458},{"$f":"IF(COUNT(trpha)=0,0,SUMPRODUCT(trUtil*trpha*trBTotal))","v":98341.920364957128},{"$f":"IF(COUNT(trpha)=0,0,100*(1-EXP(-SUMPRODUCT((trDbh>0)*trpha,PI()*(trCWidth/2)^2)/10000)))","v":100}]
[null,"Con",null,{"$f":"IF($Q12>0,SUM(trDbh* trpha*(trSppgrp=$B12))/$Q12,0)","v":28.240557348758433},{"$f":"IF($O12>0,200*SQRT(($N12/$O12)/PI()),0)","v":28.322767821579404},{"$f":"IF(ISERROR(trpha),0,MAX(IF(trUtil,trDbh*(trSppgrp=$B12),0)))","v":31.71650770219831},{"$f":"IF(ISERROR(trpha),0,IF(SUM(IF(trUtil*trDbhIncr>0,trpha*(trSppgrp=$B12),0))>0,SUM(IF(trUtil*trDbhIncr>0,trDbhIncr*trpha*(trSppgrp=$B12),0))/SUM(IF(trUtil*trDbhIncr>0,trpha*(trSppgrp=$B12),0)),0))","v":4.9586536273571652E-2},{"$f":"IF($Q12>0,SUM(trHt*trpha*(trSppgrp=$B12))/$Q12,0)","v":27.068230506902719},{"$f":"IF($Q12>0,toptreesav(trList,$B12),0)","v":27.663239692185471},{"$f":"IF($Q12>0,toptreesav(trList,$B12,13),0)","v":4.0051068151238871E-2},{"$f":"IF(ISERROR(trpha),0,MAX(IF(trUtil,trHt*(trSppgrp=$B12),0)))","v":29.115142376342419},{"$f":"IF($O12>0,SUM(IF(trUtil,trAge* trpha*(trSppgrp=$B12),0))/$O12,0)","v":195.54178284567476},{"$f":"IF($O12>0,SUM(IF(trUtil,trBHAge* trpha*(trSppgrp=$B12),0))/$O12,0)","v":188.88008198585678},{"$f":"IF(ISERROR(trpha),0,SUM(IF(trUtil,trBaHa*(trSppgrp=$B12))))","v":9.3103080759502976},{"$f":"IF(ISERROR(trpha),0,SUM(IF(trUtil,trpha*(trSppgrp=$B12),0)))","v":147.77561864906599},{"$f":"IF(ISERROR(trpha),0,SUM(IF(NOT(trUtil),trpha*(trSppgrp=$B12),0)))","v":0},{"$f":"IF(ISERROR(trpha),0,SUM(trpha*(trSppgrp=$B12)))","v":147.77561864906599},{"$f":"IF($N12>0,$N12/stBa,0)","v":0.50530718931161578},{"$f":"IF($O12>0,$O12/stDen,0)","v":0.67005809646390313},{"$f":"IF($O12>0,$O12/stDen,0)","v":0.67005809646390313},0.30390562654927483,{"$f":"IF(ISERROR(trpha),0,SUM(IF(NAErr<>trVol,trUtil*trVol*trVRF*trpha*(trSppgrp=$B12),0)))","v":102.24112063386693},{"$f":"IF(ISERROR(trpha),0,SUM(IF(NAErr<>trVol,trUtil*trVol*trpha*(trSppgrp=$B12),0)))","v":102.24112063386693},{"$f":"IF(ISERROR(trpha),0,SUM(IF(NOT(trJuv),trpha*(trSppgrp=$B12),0)))","v":147.77561864906599},{"$f":"IF(ISERROR(trpha),0,SUM(IF(trJuv,trpha*(trSppgrp=$B12),0)))","v":0},{"$f":"IF($Y12>0,SUM(IF(trJuv,trHt*trpha*(trSppgrp=$B12),0))/$Y12,0)","v":0},{"$f":"IF($O12>0,toptreesav(trList,$B12,colTrDbh),0)","v":29.461819680502757},{"$f":"IF(COUNT(trpha)=0,0,SUMPRODUCT((trPsurv>0)*trpha*(trSppgrp=$B12)*(1/trPsurv-1)))","v":0.93479137208027741},{"$f":"IF(COUNT(trpha)=0,0,SUMPRODUCT((trPsurv>0)*(trBaHa>0)*trBaHa*(trSppgrp=$B12)*(1/trPsurv-1)))","v":5.8345321508263333E-2},{"$f":"IF(COUNT(trpha)=0,0,SUMPRODUCT((trPsurv>0)*(trVol>0)*(trSppgrp=$B12)*trUtil*trVol*(trpha/trPsurv-trpha)))","v":0.63950423018484992},{"$f":"IF(AD12=0,0,$N12-SUMPRODUCT(trUtil*(trHtIncr>0)*(trSppgrp=$B12)*trpha*PI()*((trDbh-trDbhIncr)/200)^2))","v":3.2595651326193575E-2},{"$f":"IF(COUNT(trpha)=0,0,SUMPRODUCT(trUtil*(trHtIncr>0)*(trSppgrp=$B12)*trpha*trVolSurvGrth))","v":0.48669509830967972},0.51120560316933461,0,{"$f":"IF(COUNT(trpha)=0,0,SUMPRODUCT(trUtil*(trSppgrp=$B12)*trpha*trBWood))","v":29473.934817504516},{"$f":"IF(COUNT(trpha)=0,0,SUMPRODUCT(trUtil*(trSppgrp=$B12)*trpha*trBBark))","v":3784.7665631987952},{"$f":"IF(COUNT(trpha)=0,0,SUMPRODUCT(trUtil*(trSppgrp=$B12)*trpha*trBBranch))","v":4419.6345753213573},{"$f":"IF(COUNT(trpha)=0,0,SUMPRODUCT(trUtil*(trSppgrp=$B12)*trpha*trBFoliage))","v":3186.3434448546336},{"$f":"IF(COUNT(trpha)=0,0,SUMPRODUCT(trUtil*(trSppgrp=$B12)*trpha*trBTotal))","v":40864.679400879308},{"$f":"IF(COUNT(trpha)=0,0,100*(1-EXP(-SUMPRODUCT((trDbh>0)*trpha*(trSppgrp=$B12),PI()*(trCWidth/2)^2)/10000)))","v":100}]
[null,"Dec",null,{"$f":"IF($Q13>0,SUM(trDbh* trpha*(trSppgrp=$B13))/$Q13,0)","v":38.966212304343621},{"$f":"IF($O13>0,200*SQRT(($N13/$O13)/PI()),0)","v":39.935878722131783},{"$f":"IF(ISERROR(trpha),0,MAX(IF(trUtil,trDbh*(trSppgrp=$B13),0)))","v":59.019213080698897},{"$f":"IF(ISERROR(trpha),0,IF(SUM(IF(trUtil*trDbhIncr>0,trpha*(trSppgrp=$B13),0))>0,SUM(IF(trUtil*trDbhIncr>0,trDbhIncr*trpha*(trSppgrp=$B13),0))/SUM(IF(trUtil*trDbhIncr>0,trpha*(trSppgrp=$B13),0)),0))","v":7.9633951330676744E-2},{"$f":"IF($Q13>0,SUM(trHt*trpha*(trSppgrp=$B13))/$Q13,0)","v":30.715733561488367},{"$f":"IF($Q13>0,toptreesav(trList,$B13),0)","v":30.715733561488367},{"$f":"IF($Q13>0,toptreesav(trList,$B13,13),0)","v":2.7881789587012762E-2},{"$f":"IF(ISERROR(trpha),0,MAX(IF(trUtil,trHt*(trSppgrp=$B13),0)))","v":35.044209820452949},{"$f":"IF($O13>0,SUM(IF(trUtil,trAge* trpha*(trSppgrp=$B13),0))/$O13,0)","v":197.68485801728158},{"$f":"IF($O13>0,SUM(IF(trUtil,trBHAge* trpha*(trSppgrp=$B13),0))/$O13,0)","v":195.72821099058081},{"$f":"IF(ISERROR(trpha),0,SUM(IF(trUtil,trBaHa*(trSppgrp=$B13))))","v":9.1147376643127949},{"$f":"IF(ISERROR(trpha),0,SUM(IF(trUtil,trpha*(trSppgrp=$B13),0)))","v":72.765882795244735},{"$f":"IF(ISERROR(trpha),0,SUM(IF(NOT(trUtil),trpha*(trSppgrp=$B13),0)))","v":0},{"$f":"IF(ISERROR(trpha),0,SUM(trpha*(trSppgrp=$B13)))","v":72.765882795244735},0.49469281068838472,{"$f":"IF($O13>0,$O13/stDen,0)","v":0.32994190353609687},{"$f":"IF($O13>0,$O13/stDen,0)","v":0.32994190353609687},0.3816587354337041,{"$f":"IF(ISERROR(trpha),0,SUM(IF(NAErr<>trVol,trUtil*trVol*trVRF*trpha*(trSppgrp=$B13),0)))","v":115.71530759556367},{"$f":"IF(ISERROR(trpha),0,SUM(IF(NAErr<>trVol,trUtil*trVol*trpha*(trSppgrp=$B13),0)))","v":115.71530759556367},{"$f":"IF(ISERROR(trpha),0,SUM(IF(NOT(trJuv),trpha*(trSppgrp=$B13),0)))","v":72.765882795244735},{"$f":"IF(ISERROR(trpha),0,SUM(IF(trJuv,trpha*(trSppgrp=$B13),0)))","v":0},{"$f":"IF($Y13>0,SUM(IF(trJuv,trHt*trpha*(trSppgrp=$B13),0))/$Y13,0)","v":0},{"$f":"IF($O13>0,toptreesav(trList,$B13,colTrDbh),0)","v":38.966212304343621},{"$f":"IF(COUNT(trpha)=0,0,SUMPRODUCT((trPsurv>0)*trpha*(trSppgrp=$B13)*(1/trPsurv-1)))","v":1.3660934745106561},{"$f":"IF(COUNT(trpha)=0,0,SUMPRODUCT((trPsurv>0)*(trBaHa>0)*trBaHa*(trSppgrp=$B13)*(1/trPsurv-1)))","v":0.21037362415114874},{"$f":"IF(COUNT(trpha)=0,0,SUMPRODUCT((trPsurv>0)*(trVol>0)*(trSppgrp=$B13)*trUtil*trVol*(trpha/trPsurv-trpha)))","v":2.7274003022147926},{"$f":"IF(AD13=0,0,$N13-SUMPRODUCT(trUtil*(trHtIncr>0)*(trSppgrp=$B13)*trpha*PI()*((trDbh-trDbhIncr)/200)^2))","v":3.7377216755022147E-2},{"$f":"IF(COUNT(trpha)=0,0,SUMPRODUCT(trUtil*(trHtIncr>0)*(trSppgrp=$B13)*trpha*trVolSurvGrth))","v":0.54713694211660324},0.57857653797781838,0,{"$f":"IF(COUNT(trpha)=0,0,SUMPRODUCT(trUtil*(trSppgrp=$B13)*trpha*trBWood))","v":41609.891985610564},{"$f":"IF(COUNT(trpha)=0,0,SUMPRODUCT(trUtil*(trSppgrp=$B13)*trpha*trBBark))","v":8553.2021730095512},{"$f":"IF(COUNT(trpha)=0,0,SUMPRODUCT(trUtil*(trSppgrp=$B13)*trpha*trBBranch))","v":6550.1745339472373},{"$f":"IF(COUNT(trpha)=0,0,SUMPRODUCT(trUtil*(trSppgrp=$B13)*trpha*trBFoliage))","v":763.97227151051334},{"$f":"IF(COUNT(trpha)=0,0,SUMPRODUCT(trUtil*(trSppgrp=$B13)*trpha*trBTotal))","v":57477.240964077857},{"$f":"IF(COUNT(trpha)=0,0,100*(1-EXP(-SUMPRODUCT((trDbh>0)*trpha*(trSppgrp=$B13),PI()*(trCWidth/2)^2)/10000)))","v":99.999999999748653}]
[6.6626606260392744,"Sw",20.559999465942383,{"$f":"IF($Q14>0,SUM(trDbh* trpha*(trMGMSpp=$B14))/$Q14,0)","v":28.240557348758433},{"$f":"IF($O14>0,200*SQRT(($N14/$O14)/PI()),0)","v":28.322767821579404},{"$f":"IF(ISERROR(trpha),0,MAX(IF(trUtil,trDbh*(trMGMSpp=$B14),0)))","v":31.71650770219831},{"$f":"IF(ISERROR(trpha),0,IF(SUM(IF(trUtil*trDbhIncr>0,trpha*(trMGMSpp=$B14),0))>0,SUM(IF(trUtil*trDbhIncr>0,trDbhIncr*trpha*(trMGMSpp=$B14),0))/SUM(IF(trUtil*trDbhIncr>0,trpha*(trMGMSpp=$B14),0)),0))","v":4.9586536273571652E-2},{"$f":"IF($Q14>0,SUM(trHt*trpha*(trMGMSpp=$B14))/$Q14,0)","v":27.068230506902719},{"$f":"IF($Q14>0,toptreesav(trList,$B14),0)","v":27.663239692185471},{"$f":"IF($Q14>0,toptreesav(trList,$B14,13),0)","v":4.0051068151238871E-2},{"$f":"IF(ISERROR(trpha),0,MAX(IF(trUtil,trHt*(trMGMSpp=$B14),0)))","v":29.115142376342419},{"$f":"IF($O14>0,SUM(IF(trUtil,trAge* trpha*(trMGMSpp=$B14),0))/$O14,0)","v":195.54178284567476},{"$f":"IF($O14>0,SUM(IF(trUtil,trBHAge* trpha*(trMGMSpp=$B14),0))/$O14,0)","v":188.88008198585678},{"$f":"IF(ISERROR(trpha),0,SUM(IF(trUtil,trBaHa*(trMGMSpp=$B14))))","v":9.3103080759502976},{"$f":"IF(ISERROR(trpha),0,SUM(IF(trUtil,trpha*(trMGMSpp=$B14),0)))","v":147.77561864906599},{"$f":"IF(ISERROR(trpha),0,SUM(IF(NOT(trUtil),trpha*(trMGMSpp=$B14),0)))","v":0},{"$f":"IF(ISERROR(trpha),0,SUM(trpha*(trMGMSpp=$B14)))","v":147.77561864906599},0.50530718931161578,{"$f":"IF($O14>0,$O14/stDen,0)","v":0.67005809646390313},{"$f":"IF($Q14>0,$Q14/stTotDen,0)","v":0.67005809646390313},0.30390562654927483,{"$f":"IF(ISERROR(trpha),0,SUM(IF(NAErr<>trVol,trUtil*trVol*trVRF*trpha*(trMGMSpp=$B14),0)))","v":102.24112063386693},{"$f":"IF(ISERROR(trpha),0,SUM(IF(NAErr<>trVol,trUtil*trVol*trpha*(trMGMSpp=$B14),0)))","v":102.24112063386693},{"$f":"IF(ISERROR(trpha),0,SUM(IF(NOT(trJuv),trpha*(trMGMSpp=$B14),0)))","v":147.77561864906599},{"$f":"IF(ISERROR(trpha),0,SUM(IF(trJuv,trpha*(trMGMSpp=$B14),0)))","v":0},{"$f":"IF($Y14>0,SUM(IF(trJuv,trHt*trpha*(trMGMSpp=$B14),0))/$Y14,0)","v":0},{"$f":"IF($O14>0,toptreesav(trList,$B14,colTrDbh),0)","v":29.461819680502757},{"$f":"IF(COUNT(trpha)=0,0,SUMPRODUCT((trPsurv>0)*trpha*(trMGMSpp=$B14)*(1/trPsurv-1)))","v":0.93479137208027741},{"$f":"IF(COUNT(trpha)=0,0,SUMPRODUCT((trPsurv>0)*(trBaHa>0)*trBaHa*(trMGMSpp=$B14)*(1/trPsurv-1)))","v":5.8345321508263333E-2},{"$f":"IF(COUNT(trpha)=0,0,SUMPRODUCT((trPsurv>0)*(trVol>0)*(trMGMSpp=$B14)*trUtil*trVol*(trpha/trPsurv-trpha)))","v":0.63950423018484992},{"$f":"IF(AD14=0,0,$N14-SUMPRODUCT(trUtil*(trHtIncr>0)*(trMGMSpp=$B14)*trpha*PI()*((trDbh-trDbhIncr)/200)^2))","v":3.2595651326193575E-2},{"$f":"IF(COUNT(trpha)=0,0,SUMPRODUCT(trUtil*(trHtIncr>0)*(trMGMSpp=$B14)*trpha*trVolSurvGrth))","v":0.48669509830967972},0.51120560316933461,0,{"$f":"IF(COUNT(trpha)=0,0,SUMPRODUCT(trUtil*(trMGMSpp=$B14)*trpha*trBWood))","v":29473.934817504516},{"$f":"IF(COUNT(trpha)=0,0,SUMPRODUCT(trUtil*(trMGMSpp=$B14)*trpha*trBBark))","v":3784.7665631987952},{"$f":"IF(COUNT(trpha)=0,0,SUMPRODUCT(trUtil*(trMGMSpp=$B14)*trpha*trBBranch))","v":4419.6345753213573},{"$f":"IF(COUNT(trpha)=0,0,SUMPRODUCT(trUtil*(trMGMSpp=$B14)*trpha*trBFoliage))","v":3186.3434448546336},{"$f":"IF(COUNT(trpha)=0,0,SUMPRODUCT(trUtil*(trMGMSpp=$B14)*trpha*trBTotal))","v":40864.679400879308},{"$f":"IF(COUNT(trpha)=0,0,100*(1-EXP(-SUMPRODUCT((trDbh>0)*trpha*(trMGMSpp=$B14),PI()*(trCWidth/2)^2)/10000)))","v":100}]
[8,"Pl",19.299999237060547,{"$f":"IF($Q15>0,SUM(trDbh* trpha*(trMGMSpp=$B15))/$Q15,0)","v":0},{"$f":"IF($O15>0,200*SQRT(($N15/$O15)/PI()),0)","v":0},{"$f":"IF(ISERROR(trpha),0,MAX(IF(trUtil,trDbh*(trMGMSpp=$B15),0)))","v":0},{"$f":"IF(ISERROR(trpha),0,IF(SUM(IF(trUtil*trDbhIncr>0,trpha*(trMGMSpp=$B15),0))>0,SUM(IF(trUtil*trDbhIncr>0,trDbhIncr*trpha*(trMGMSpp=$B15),0))/SUM(IF(trUtil*trDbhIncr>0,trpha*(trMGMSpp=$B15),0)),0))","v":0},{"$f":"IF($Q15>0,SUM(trHt*trpha*(trMGMSpp=$B15))/$Q15,0)","v":0},{"$f":"IF($Q15>0,toptreesav(trList,$B15),0)","v":0},{"$f":"IF($Q15>0,toptreesav(trList,$B15,13),0)","v":0},{"$f":"IF(ISERROR(trpha),0,MAX(IF(trUtil,trHt*(trMGMSpp=$B15),0)))","v":0},{"$f":"IF($O15>0,SUM(IF(trUtil,trAge* trpha*(trMGMSpp=$B15),0))/$O15,0)","v":0},{"$f":"IF($O15>0,SUM(IF(trUtil,trBHAge* trpha*(trMGMSpp=$B15),0))/$O15,0)","v":0},{"$f":"IF(ISERROR(trpha),0,SUM(IF(trUtil,trBaHa*(trMGMSpp=$B15))))","v":0},{"$f":"IF(ISERROR(trpha),0,SUM(IF(trUtil,trpha*(trMGMSpp=$B15),0)))","v":0},{"$f":"IF(ISERROR(trpha),0,SUM(IF(NOT(trUtil),trpha*(trMGMSpp=$B15),0)))","v":0},{"$f":"IF(ISERROR(trpha),0,SUM(trpha*(trMGMSpp=$B15)))","v":0},0,{"$f":"IF($O15>0,$O15/stDen,0)","v":0},{"$f":"IF($Q15>0,$Q15/stTotDen,0)","v":0},1,{"$f":"IF(ISERROR(trpha),0,SUM(IF(NAErr<>trVol,trUtil*trVol*trVRF*trpha*(trMGMSpp=$B15),0)))","v":0},{"$f":"IF(ISERROR(trpha),0,SUM(IF(NAErr<>trVol,trUtil*trVol*trpha*(trMGMSpp=$B15),0)))","v":0},{"$f":"IF(ISERROR(trpha),0,SUM(IF(NOT(trJuv),trpha*(trMGMSpp=$B15),0)))","v":0},{"$f":"IF(ISERROR(trpha),0,SUM(IF(trJuv,trpha*(trMGMSpp=$B15),0)))","v":0},{"$f":"IF($Y15>0,SUM(IF(trJuv,trHt*trpha*(trMGMSpp=$B15),0))/$Y15,0)","v":0},{"$f":"IF($O15>0,toptreesav(trList,$B15,colTrDbh),0)","v":0},{"$f":"IF(COUNT(trpha)=0,0,SUMPRODUCT((trPsurv>0)*trpha*(trMGMSpp=$B15)*(1/trPsurv-1)))","v":0},{"$f":"IF(COUNT(trpha)=0,0,SUMPRODUCT((trPsurv>0)*(trBaHa>0)*trBaHa*(trMGMSpp=$B15)*(1/trPsurv-1)))","v":0},{"$f":"IF(COUNT(trpha)=0,0,SUMPRODUCT((trPsurv>0)*(trVol>0)*(trMGMSpp=$B15)*trUtil*trVol*(trpha/trPsurv-trpha)))","v":0},{"$f":"IF(AD15=0,0,$N15-SUMPRODUCT(trUtil*(trHtIncr>0)*(trMGMSpp=$B15)*trpha*PI()*((trDbh-trDbhIncr)/200)^2))","v":0},{"$f":"IF(COUNT(trpha)=0,0,SUMPRODUCT(trUtil*(trHtIncr>0)*(trMGMSpp=$B15)*trpha*trVolSurvGrth))","v":0},0,0,{"$f":"IF(COUNT(trpha)=0,0,SUMPRODUCT(trUtil*(trMGMSpp=$B15)*trpha*trBWood))","v":0},{"$f":"IF(COUNT(trpha)=0,0,SUMPRODUCT(trUtil*(trMGMSpp=$B15)*trpha*trBBark))","v":0},{"$f":"IF(COUNT(trpha)=0,0,SUMPRODUCT(trUtil*(trMGMSpp=$B15)*trpha*trBBranch))","v":0},{"$f":"IF(COUNT(trpha)=0,0,SUMPRODUCT(trUtil*(trMGMSpp=$B15)*trpha*trBFoliage))","v":0},{"$f":"IF(COUNT(trpha)=0,0,SUMPRODUCT(trUtil*(trMGMSpp=$B15)*trpha*trBTotal))","v":0},{"$f":"IF(COUNT(trpha)=0,0,100*(1-EXP(-SUMPRODUCT((trDbh>0)*trpha*(trMGMSpp=$B15),PI()*(trCWidth/2)^2)/10000)))","v":0}]
[1.9566470267008254,"Aw",24.329999923706055,{"$f":"IF($Q16>0,SUM(trDbh* trpha*(trMGMSpp=$B16))/$Q16,0)","v":38.966212304343621},{"$f":"IF($O16>0,200*SQRT(($N16/$O16)/PI()),0)","v":39.935878722131783},{"$f":"IF(ISERROR(trpha),0,MAX(IF(trUtil,trDbh*(trMGMSpp=$B16),0)))","v":59.019213080698897},{"$f":"IF(ISERROR(trpha),0,IF(SUM(IF(trUtil*trDbhIncr>0,trpha*(trMGMSpp=$B16),0))>0,SUM(IF(trUtil*trDbhIncr>0,trDbhIncr*trpha*(trMGMSpp=$B16),0))/SUM(IF(trUtil*trDbhIncr>0,trpha*(trMGMSpp=$B16),0)),0))","v":7.9633951330676744E-2},{"$f":"IF($Q16>0,SUM(trHt*trpha*(trMGMSpp=$B16))/$Q16,0)","v":30.715733561488367},{"$f":"IF($Q16>0,toptreesav(trList,$B16),0)","v":30.715733561488367},{"$f":"IF($Q16>0,toptreesav(trList,$B16,13),0)","v":2.7881789587012762E-2},{"$f":"IF(ISERROR(trpha),0,MAX(IF(trUtil,trHt*(trMGMSpp=$B16),0)))","v":35.044209820452949},{"$f":"IF($O16>0,SUM(IF(trUtil,trAge* trpha*(trMGMSpp=$B16),0))/$O16,0)","v":197.68485801728158},{"$f":"IF($O16>0,SUM(IF(trUtil,trBHAge* trpha*(trMGMSpp=$B16),0))/$O16,0)","v":195.72821099058081},{"$f":"IF(ISERROR(trpha),0,SUM(IF(trUtil,trBaHa*(trMGMSpp=$B16))))","v":9.1147376643127949},{"$f":"IF(ISERROR(trpha),0,SUM(IF(trUtil,trpha*(trMGMSpp=$B16),0)))","v":72.765882795244735},{"$f":"IF(ISERROR(trpha),0,SUM(IF(NOT(trUtil),trpha*(trMGMSpp=$B16),0)))","v":0},{"$f":"IF(ISERROR(trpha),0,SUM(trpha*(trMGMSpp=$B16)))","v":72.765882795244735},0.49469281068838472,{"$f":"IF($O16>0,$O16/stDen,0)","v":0.32994190353609687},{"$f":"IF($Q16>0,$Q16/stTotDen,0)","v":0.32994190353609687},0.3816587354337041,{"$f":"IF(ISERROR(trpha),0,SUM(IF(NAErr<>trVol,trUtil*trVol*trVRF*trpha*(trMGMSpp=$B16),0)))","v":115.71530759556367},{"$f":"IF(ISERROR(trpha),0,SUM(IF(NAErr<>trVol,trUtil*trVol*trpha*(trMGMSpp=$B16),0)))","v":115.71530759556367},{"$f":"IF(ISERROR(trpha),0,SUM(IF(NOT(trJuv),trpha*(trMGMSpp=$B16),0)))","v":72.765882795244735},{"$f":"IF(ISERROR(trpha),0,SUM(IF(trJuv,trpha*(trMGMSpp=$B16),0)))","v":0},{"$f":"IF($Y16>0,SUM(IF(trJuv,trHt*trpha*(trMGMSpp=$B16),0))/$Y16,0)","v":0},{"$f":"IF($O16>0,toptreesav(trList,$B16,colTrDbh),0)","v":38.966212304343621},{"$f":"IF(COUNT(trpha)=0,0,SUMPRODUCT((trPsurv>0)*trpha*(trMGMSpp=$B16)*(1/trPsurv-1)))","v":1.3660934745106561},{"$f":"IF(COUNT(trpha)=0,0,SUMPRODUCT((trPsurv>0)*(trBaHa>0)*trBaHa*(trMGMSpp=$B16)*(1/trPsurv-1)))","v":0.21037362415114874},{"$f":"IF(COUNT(trpha)=0,0,SUMPRODUCT((trPsurv>0)*(trVol>0)*(trMGMSpp=$B16)*trUtil*trVol*(trpha/trPsurv-trpha)))","v":2.7274003022147926},{"$f":"IF(AD16=0,0,$N16-SUMPRODUCT(trUtil*(trHtIncr>0)*(trMGMSpp=$B16)*trpha*PI()*((trDbh-trDbhIncr)/200)^2))","v":3.7377216755022147E-2},{"$f":"IF(COUNT(trpha)=0,0,SUMPRODUCT(trUtil*(trHtIncr>0)*(trMGMSpp=$B16)*trpha*trVolSurvGrth))","v":0.54713694211660324},0.57857653797781838,0,{"$f":"IF(COUNT(trpha)=0,0,SUMPRODUCT(trUtil*(trMGMSpp=$B16)*trpha*trBWood))","v":41609.891985610564},{"$f":"IF(COUNT(trpha)=0,0,SUMPRODUCT(trUtil*(trMGMSpp=$B16)*trpha*trBBark))","v":8553.2021730095512},{"$f":"IF(COUNT(trpha)=0,0,SUMPRODUCT(trUtil*(trMGMSpp=$B16)*trpha*trBBranch))","v":6550.1745339472373},{"$f":"IF(COUNT(trpha)=0,0,SUMPRODUCT(trUtil*(trMGMSpp=$B16)*trpha*trBFoliage))","v":763.97227151051334},{"$f":"IF(COUNT(trpha)=0,0,SUMPRODUCT(trUtil*(trMGMSpp=$B16)*trpha*trBTotal))","v":57477.240964077857},{"$f":"IF(COUNT(trpha)=0,0,100*(1-EXP(-SUMPRODUCT((trDbh>0)*trpha*(trMGMSpp=$B16),PI()*(trCWidth/2)^2)/10000)))","v":99.999999999748653}]
[15,"Sb",15.699999809265137,{"$f":"IF($Q17>0,SUM(trDbh* trpha*(trMGMSpp=$B17))/$Q17,0)","v":0},{"$f":"IF($O17>0,200*SQRT(($N17/$O17)/PI()),0)","v":0},{"$f":"IF(ISERROR(trpha),0,MAX(IF(trUtil,trDbh*(trMGMSpp=$B17),0)))","v":0},{"$f":"IF(ISERROR(trpha),0,IF(SUM(IF(trUtil*trDbhIncr>0,trpha*(trMGMSpp=$B17),0))>0,SUM(IF(trUtil*trDbhIncr>0,trDbhIncr*trpha*(trMGMSpp=$B17),0))/SUM(IF(trUtil*trDbhIncr>0,trpha*(trMGMSpp=$B17),0)),0))","v":0},{"$f":"IF($Q17>0,SUM(trHt*trpha*(trMGMSpp=$B17))/$Q17,0)","v":0},{"$f":"IF($Q17>0,toptreesav(trList,$B17),0)","v":0},{"$f":"IF($Q17>0,toptreesav(trList,$B17,13),0)","v":0},{"$f":"IF(ISERROR(trpha),0,MAX(IF(trUtil,trHt*(trMGMSpp=$B17),0)))","v":0},{"$f":"IF($O17>0,SUM(IF(trUtil,trAge* trpha*(trMGMSpp=$B17),0))/$O17,0)","v":0},{"$f":"IF($O17>0,SUM(IF(trUtil,trBHAge* trpha*(trMGMSpp=$B17),0))/$O17,0)","v":0},{"$f":"IF(ISERROR(trpha),0,SUM(IF(trUtil,trBaHa*(trMGMSpp=$B17))))","v":0},{"$f":"IF(ISERROR(trpha),0,SUM(IF(trUtil,trpha*(trMGMSpp=$B17),0)))","v":0},{"$f":"IF(ISERROR(trpha),0,SUM(IF(NOT(trUtil),trpha*(trMGMSpp=$B17),0)))","v":0},{"$f":"IF(ISERROR(trpha),0,SUM(trpha*(trMGMSpp=$B17)))","v":0},0,{"$f":"IF($O17>0,$O17/stDen,0)","v":0},{"$f":"IF($Q17>0,$Q17/stTotDen,0)","v":0},1,{"$f":"IF(ISERROR(trpha),0,SUM(IF(NAErr<>trVol,trUtil*trVol*trVRF*trpha*(trMGMSpp=$B17),0)))","v":0},{"$f":"IF(ISERROR(trpha),0,SUM(IF(NAErr<>trVol,trUtil*trVol*trpha*(trMGMSpp=$B17),0)))","v":0},{"$f":"IF(ISERROR(trpha),0,SUM(IF(NOT(trJuv),trpha*(trMGMSpp=$B17),0)))","v":0},{"$f":"IF(ISERROR(trpha),0,SUM(IF(trJuv,trpha*(trMGMSpp=$B17),0)))","v":0},{"$f":"IF($Y17>0,SUM(IF(trJuv,trHt*trpha*(trMGMSpp=$B17),0))/$Y17,0)","v":0},{"$f":"IF($O17>0,toptreesav(trList,$B17,colTrDbh),0)","v":0},{"$f":"IF(COUNT(trpha)=0,0,SUMPRODUCT((trPsurv>0)*trpha*(trMGMSpp=$B17)*(1/trPsurv-1)))","v":0},{"$f":"IF(COUNT(trpha)=0,0,SUMPRODUCT((trPsurv>0)*(trBaHa>0)*trBaHa*(trMGMSpp=$B17)*(1/trPsurv-1)))","v":0},{"$f":"IF(COUNT(trpha)=0,0,SUMPRODUCT((trPsurv>0)*(trVol>0)*(trMGMSpp=$B17)*trUtil*trVol*(trpha/trPsurv-trpha)))","v":0},{"$f":"IF(AD17=0,0,$N17-SUMPRODUCT(trUtil*(trHtIncr>0)*(trMGMSpp=$B17)*trpha*PI()*((trDbh-trDbhIncr)/200)^2))","v":0},{"$f":"IF(COUNT(trpha)=0,0,SUMPRODUCT(trUtil*(trHtIncr>0)*(trMGMSpp=$B17)*trpha*trVolSurvGrth))","v":0},0,0,{"$f":"IF(COUNT(trpha)=0,0,SUMPRODUCT(trUtil*(trMGMSpp=$B17)*trpha*trBWood))","v":0},{"$f":"IF(COUNT(trpha)=0,0,SUMPRODUCT(trUtil*(trMGMSpp=$B17)*trpha*trBBark))","v":0},{"$f":"IF(COUNT(trpha)=0,0,SUMPRODUCT(trUtil*(trMGMSpp=$B17)*trpha*trBBranch))","v":0},{"$f":"IF(COUNT(trpha)=0,0,SUMPRODUCT(trUtil*(trMGMSpp=$B17)*trpha*trBFoliage))","v":0},{"$f":"IF(COUNT(trpha)=0,0,SUMPRODUCT(trUtil*(trMGMSpp=$B17)*trpha*trBTotal))","v":0},{"$f":"IF(COUNT(trpha)=0,0,100*(1-EXP(-SUMPRODUCT((trDbh>0)*trpha*(trMGMSpp=$B17),PI()*(trCWidth/2)^2)/10000)))","v":0}]
[]
[]
["trNum","trSpp","trDbh","trPha","trHt","trAge","trBHAge","trCratio","trCwidth","x","y","trDbhIncr","trHtIncr","trPsurv","trSppIdx","trMGMSppIdx","trBWood","trBBark","trBBranch","trBFoliage","trBTotal","HIDIratio","Hdratio","trBaHa","stBagt","stCbagt","stDbagt","trSppgrp","trMGMspp","PctRank","trVol","trUtil","trVRF","trJuv","trSWGGR","trPLGGR","trDECDBHGR","trSWDBHGR","trPLDBHGR","trSBDBHGR","trVolSurvGrth","trChar01","trChar02","trChar03","trChar04","trChar05","trChar06","trChar07","trChar08","trChar09","trChar10","trChar11","trChar12","trChar13","trChar14","trChar15","trChar16","trChar17","trChar18","trChar19","tmpKey"]
[34,"AW",59.019213080698897,0.76559769349305984,35.044209820452949,199.89198003137281,197.93533300467197,0.23876488399672541,6.8363069287954676,94,4,9.7088038066814875E-2,2.7602544561695197E-2,0.93222023112463026,3,3,1462.0562305698938,292.86091196964617,233.59996999336096,20.140403659774837,2008.6575161926758,{"$f":"IF(AND(NAErr<>$L21,NAErr<>$M21),$M21/$L21,NAErr)","v":0.28430427796573088},{"$f":"IF(AND($E21<>NAErr,$C21<>NAErr),$E21/$C21,NAErr)","v":0.5937762974327675},{"$f":"IF(AND($E21<>NAErr,$C21<>NAErr),$D21*PI()*($C21/200)^2,NAErr)","v":0.20944853500212979},{"$f":"IF($C21=NAErr,NAErr,SUM(IF(trUtil,(trDbh>$C21)*trBaHa,0)))","v":0},{"$f":"IF($C21=NAErr,NAErr,SUM(IF(trUtil,(trDbh>$C21)*trBaHa*(trSppgrp=\"Con\"),0)))","v":0},{"$f":"IF($C21=NAErr,NAErr,SUM(IF(trUtil,(trDbh>$C21)*trBaHa*(trSppgrp=\"Dec\"),0)))","v":0},{"$f":"IF(ISERROR($O21),NAErr,INDEX(INDIRECT(\"SpeciesList!SppGrp\"),$O21))","v":"Dec"},{"$f":"IF(ISERROR($O21),NAErr,INDEX(INDIRECT(\"SpeciesList!MGM\"),$O21))","v":"Aw"},{"$f":"IF($C21<>NAErr,PERCENTRANK(trDbh,$C21),NAErr)","v":1},{"$f":"volest($O21 - 1, $C21, $E21)","v":3.6248705278518178},{"$f":"isutilized($O21, $C21)","v":true},{"$f":"ROUND(VRF($B21),3)","v":1},{"$f":"isjuveniletree($C21)","v":false},{"$f":"SUM(IF(trUtil,(trDbh>$C21)*trBaHa*(trMGMSpp=\"Sw\"),0))","v":0},{"$f":"SUM(IF(trUtil,(trDbh>$C21)*trBaHa*(trMGMSpp=\"Pl\"),0))","v":0},{"$f":"SUM(IF(trUtil,(trDbh>$C21)*trDbh*trpha*(trSppgrp=\"Dec\"),0))","v":0},{"$f":"SUM(IF(trUtil,(trDbh>$C21)*trDbh*trpha*(trMGMSpp=\"Sw\"),0))","v":0},{"$f":"SUM(IF(trUtil,(trDbh>$C21)*trDbh*trpha*(trMGMSpp=\"Pl\"),0))","v":0},{"$f":"SUM(IF(trUtil,(trDbh>$C21)*trDbh*trpha*(trMGMSpp=\"Sb\"),0))","v":0},{"$f":"IF(AND(($C21-$L21)>0,$L21>0),$AE21-MAX(0,volest($O21-1,$C21-$L21,$E21-$M21)),0)","v":1.3765777241750765E-2},-1,-1,-1,-1,-1,-1,-1,-1,-1,-1,-1,-1,-1,-1,-1,-1,-1,-1,-1,34]
[3,"AW",57.035097971156731,1.3524944461777086,35.005817237386005,198.77279067558786,196.81614364888702,0.24129121576788398,6.8182470366691632,99,64,9.7843443501649266E-2,2.7855753298815698E-2,0.94619949158176142,3,3,1343.4060492849035,269.83247511662813,214.30233823303394,19.048234851986315,1846.5890974865517,{"$f":"IF(AND(NAErr<>$L22,NAErr<>$M22),$M22/$L22,NAErr)","v":0.28469718871194633},{"$f":"IF(AND($E22<>NAErr,$C22<>NAErr),$E22/$C22,NAErr)","v":0.6137592198945433},{"$f":"IF(AND($E22<>NAErr,$C22<>NAErr),$D22*PI()*($C22/200)^2,NAErr)","v":0.34554909155775548},{"$f":"IF($C22=NAErr,NAErr,SUM(IF(trUtil,(trDbh>$C22)*trBaHa,0)))","v":0.20944853500212979},{"$f":"IF($C22=NAErr,NAErr,SUM(IF(trUtil,(trDbh>$C22)*trBaHa*(trSppgrp=\"Con\"),0)))","v":0},{"$f":"IF($C22=NAErr,NAErr,SUM(IF(trUtil,(trDbh>$C22)*trBaHa*(trSppgrp=\"Dec\"),0)))","v":0.20944853500212979},{"$f":"IF(ISERROR($O22),NAErr,INDEX(INDIRECT(\"SpeciesList!SppGrp\"),$O22))","v":"Dec"},{"$f":"IF(ISERROR($O22),NAErr,INDEX(INDIRECT(\"SpeciesList!MGM\"),$O22))","v":"Aw"},{"$f":"IF($C22<>NAErr,PERCENTRANK(trDbh,$C22),NAErr)","v":0.98399999999999999},{"$f":"volest($O22 - 1, $C22, $E22)","v":3.4016349088994104},{"$f":"isutilized($O22, $C22)","v":true},{"$f":"ROUND(VRF($B22),3)","v":1},{"$f":"isjuveniletree($C22)","v":false},{"$f":"SUM(IF(trUtil,(trDbh>$C22)*trBaHa*(trMGMSpp=\"Sw\"),0))","v":0},{"$f":"SUM(IF(trUtil,(trDbh>$C22)*trBaHa*(trMGMSpp=\"Pl\"),0))","v":0},{"$f":"SUM(IF(trUtil,(trDbh>$C22)*trDbh*trpha*(trSppgrp=\"Dec\"),0))","v":45.184973406358502},{"$f":"SUM(IF(trUtil,(trDbh>$C22)*trDbh*trpha*(trMGMSpp=\"Sw\"),0))","v":0},{"$f":"SUM(IF(trUtil,(trDbh>$C22)*trDbh*trpha*(trMGMSpp=\"Pl\"),0))","v":0},{"$f":"SUM(IF(trUtil,(trDbh>$C22)*trDbh*trpha*(trMGMSpp=\"Sb\"),0))","v":0},{"$f":"IF(AND(($C22-$L22)>0,$L22>0),$AE22-MAX(0,volest($O22-1,$C22-$L22,$E22-$M22)),0)","v":1.3413478393028644E-2},-1,-1,-1,-1,-1,-1,-1,-1,-1,-1,-1,-1,-1,-1,-1,-1,-1,-1,-1,3]
[25,"AW",56.306201543185459,1.4806346643353909,34.923983694090545,197.59836843186989,195.64172140516905,0.24253189967615257,6.8080529384151536,95,80,9.8561262158590832E-2,2.8125360415084642E-2,0.95022295366160192,3,3,1301.3138293916663,261.64738474615166,207.46386603694503,18.652943964578608,1789.0780241393416,{"$f":"IF(AND(NAErr<>$L23,NAErr<>$M23),$M23/$L23,NAErr)","v":0.28535917457945387},{"$f":"IF(AND($E23<>NAErr,$C23<>NAErr),$E23/$C23,NAErr)","v":0.62025110444192755},{"$f":"IF(AND($E23<>NAErr,$C23<>NAErr),$D23*PI()*($C23/200)^2,NAErr)","v":0.36868057417023598},{"$f":"IF($C23=NAErr,NAErr,SUM(IF(trUtil,(trDbh>$C23)*trBaHa,0)))","v":0.55499762655988527},{"$f":"IF($C23=NAErr,NAErr,SUM(IF(trUtil,(trDbh>$C23)*trBaHa*(trSppgrp=\"Con\"),0)))","v":0},{"$f":"IF($C23=NAErr,NAErr,SUM(IF(trUtil,(trDbh>$C23)*trBaHa*(trSppgrp=\"Dec\"),0)))","v":0.55499762655988527},{"$f":"IF(ISERROR($O23),NAErr,INDEX(INDIRECT(\"SpeciesList!SppGrp\"),$O23))","v":"Dec"},{"$f":"IF(ISERROR($O23),NAErr,INDEX(INDIRECT(\"SpeciesList!MGM\"),$O23))","v":"Aw"},{"$f":"IF($C23<>NAErr,PERCENTRANK(trDbh,$C23),NAErr)","v":0.96899999999999997},{"$f":"volest($O23 - 1, $C23, $E23)","v":3.3145977524040786},{"$f":"isutilized($O23, $C23)","v":true},{"$f":"ROUND(VRF($B23),3)","v":1},{"$f":"isjuveniletree($C23)","v":false},{"$f":"SUM(IF(trUtil,(trDbh>$C23)*trBaHa*(trMGMSpp=\"Sw\"),0))","v":0},{"$f":"SUM(IF(trUtil,(trDbh>$C23)*trBaHa*(trMGMSpp=\"Pl\"),0))","v":0},{"$f":"SUM(IF(trUtil,(trDbh>$C23)*trDbh*trpha*(trSppgrp=\"Dec\"),0))","v":122.32462664954949},{"$f":"SUM(IF(trUtil,(trDbh>$C23)*trDbh*trpha*(trMGMSpp=\"Sw\"),0))","v":0},{"$f":"SUM(IF(trUtil,(trDbh>$C23)*trDbh*trpha*(trMGMSpp=\"Pl\"),0))","v":0},{"$f":"SUM(IF(trUtil,(trDbh>$C23)*trDbh*trpha*(trMGMSpp=\"Sb\"),0))","v":0},{"$f":"IF(AND(($C23-$L23)>0,$L23>0),$AE23-MAX(0,volest($O23-1,$C23-$L23,$E23-$M23)),0)","v":1.3325328039596407E-2},-1,-1,-1,-1,-1,-1,-1,-1,-1,-1,-1,-1,-1,-1,-1,-1,-1,-1,-1,25]
[17,"AW",55.002492870100873,1.8517247566363406,34.774188381159256,196.79012311096545,194.83347608426465,0.24457630911079303,6.7850498462160944,79,42,9.8972088434268218E-2,2.8313252246985367E-2,0.95663138435134976,3,3,1228.0095629770813,247.37227764985431,195.56453662865871,17.953946591869542,1688.9003238474638,{"$f":"IF(AND(NAErr<>$L24,NAErr<>$M24),$M24/$L24,NAErr)","v":0.28607310096108018},{"$f":"IF(AND($E24<>NAErr,$C24<>NAErr),$E24/$C24,NAErr)","v":0.63222931482915312},{"$f":"IF(AND($E24<>NAErr,$C24<>NAErr),$D24*PI()*($C24/200)^2,NAErr)","v":0.4399781011764296},{"$f":"IF($C24=NAErr,NAErr,SUM(IF(trUtil,(trDbh>$C24)*trBaHa,0)))","v":0.92367820073012119},{"$f":"IF($C24=NAErr,NAErr,SUM(IF(trUtil,(trDbh>$C24)*trBaHa*(trSppgrp=\"Con\"),0)))","v":0},{"$f":"IF($C24=NAErr,NAErr,SUM(IF(trUtil,(trDbh>$C24)*trBaHa*(trSppgrp=\"Dec\"),0)))","v":0.92367820073012119},{"$f":"IF(ISERROR($O24),NAErr,INDEX(INDIRECT(\"SpeciesList!SppGrp\"),$O24))","v":"Dec"},{"$f":"IF(ISERROR($O24),NAErr,INDEX(INDIRECT(\"SpeciesList!MGM\"),$O24))","v":"Aw"},{"$f":"IF($C24<>NAErr,PERCENTRANK(trDbh,$C24),NAErr)","v":0.95299999999999996},{"$f":"volest($O24 - 1, $C24, $E24)","v":3.1614336490047608},{"$f":"isutilized($O24, $C24)","v":true},{"$f":"ROUND(VRF($B24),3)","v":1},{"$f":"isjuveniletree($C24)","v":false},{"$f":"SUM(IF(trUtil,(trDbh>$C24)*trBaHa*(trMGMSpp=\"Sw\"),0))","v":0},{"$f":"SUM(IF(trUtil,(trDbh>$C24)*trBaHa*(trMGMSpp=\"Pl\"),0))","v":0},{"$f":"SUM(IF(trUtil,(trDbh>$C24)*trDbh*trpha*(trSppgrp=\"Dec\"),0))","v":205.69354047144475},{"$f":"SUM(IF(trUtil,(trDbh>$C24)*trDbh*trpha*(trMGMSpp=\"Sw\"),0))","v":0},{"$f":"SUM(IF(trUtil,(trDbh>$C24)*trDbh*trpha*(trMGMSpp=\"Pl\"),0))","v":0},{"$f":"SUM(IF(trUtil,(trDbh>$C24)*trDbh*trpha*(trMGMSpp=\"Sb\"),0))","v":0},{"$f":"IF(AND(($C24-$L24)>0,$L24>0),$AE24-MAX(0,volest($O24-1,$C24-$L24,$E24-$M24)),0)","v":1.3040755691494432E-2},-1,-1,-1,-1,-1,-1,-1,-1,-1,-1,-1,-1,-1,-1,-1,-1,-1,-1,-1,17]
[38,"AW",50.969382993332097,3.485365785895441,34.590746137387136,197.87121654012981,195.914569513429,0.24723999047356005,6.6751450876486498,37,68,9.7797904618852405E-2,2.8062264474473755E-2,0.97079991249307385,3,3,1017.0588448151782,206.13156807402979,161.39863163692576,15.857609334962396,1400.4466538610961,{"$f":"IF(AND(NAErr<>$L25,NAErr<>$M25),$M25/$L25,NAErr)","v":0.286941367341568},{"$f":"IF(AND($E25<>NAErr,$C25<>NAErr),$E25/$C25,NAErr)","v":0.67865734497732411},{"$f":"IF(AND($E25<>NAErr,$C25<>NAErr),$D25*PI()*($C25/200)^2,NAErr)","v":0.71114309511156681},{"$f":"IF($C25=NAErr,NAErr,SUM(IF(trUtil,(trDbh>$C25)*trBaHa,0)))","v":1.3636563019065508},{"$f":"IF($C25=NAErr,NAErr,SUM(IF(trUtil,(trDbh>$C25)*trBaHa*(trSppgrp=\"Con\"),0)))","v":0},{"$f":"IF($C25=NAErr,NAErr,SUM(IF(trUtil,(trDbh>$C25)*trBaHa*(trSppgrp=\"Dec\"),0)))","v":1.3636563019065508},{"$f":"IF(ISERROR($O25),NAErr,INDEX(INDIRECT(\"SpeciesList!SppGrp\"),$O25))","v":"Dec"},{"$f":"IF(ISERROR($O25),NAErr,INDEX(INDIRECT(\"SpeciesList!MGM\"),$O25))","v":"Aw"},{"$f":"IF($C25<>NAErr,PERCENTRANK(trDbh,$C25),NAErr)","v":0.93799999999999994},{"$f":"volest($O25 - 1, $C25, $E25)","v":2.7332570443929729},{"$f":"isutilized($O25, $C25)","v":true},{"$f":"ROUND(VRF($B25),3)","v":1},{"$f":"isjuveniletree($C25)","v":false},{"$f":"SUM(IF(trUtil,(trDbh>$C25)*trBaHa*(trMGMSpp=\"Sw\"),0))","v":0},{"$f":"SUM(IF(trUtil,(trDbh>$C25)*trBaHa*(trMGMSpp=\"Pl\"),0))","v":0},{"$f":"SUM(IF(trUtil,(trDbh>$C25)*trDbh*trpha*(trSppgrp=\"Dec\"),0))","v":307.54301819572436},{"$f":"SUM(IF(trUtil,(trDbh>$C25)*trDbh*trpha*(trMGMSpp=\"Sw\"),0))","v":0},{"$f":"SUM(IF(trUtil,(trDbh>$C25)*trDbh*trpha*(trMGMSpp=\"Pl\"),0))","v":0},{"$f":"SUM(IF(trUtil,(trDbh>$C25)*trDbh*trpha*(trMGMSpp=\"Sb\"),0))","v":0},{"$f":"IF(AND(($C25-$L25)>0,$L25>0),$AE25-MAX(0,volest($O25-1,$C25-$L25,$E25-$M25)),0)","v":1.1920913155747836E-2},-1,-1,-1,-1,-1,-1,-1,-1,-1,-1,-1,-1,-1,-1,-1,-1,-1,-1,-1,38]
[40,"AW",48.418120406736364,4.2745065276943111,34.305654848544847,198.28298547311988,196.32633844641904,0.24879525195428479,6.5753843579703313,18,94,9.6961279548236093E-2,2.7967312883064532E-2,0.97634571978753237,3,3,895.674050004935,182.27821371916272,141.79762991693937,14.584026005494124,1234.3339196465311,{"$f":"IF(AND(NAErr<>$L26,NAErr<>$M26),$M26/$L26,NAErr)","v":0.28843795186460397},{"$f":"IF(AND($E26<>NAErr,$C26<>NAErr),$E26/$C26,NAErr)","v":0.70852925640979525},{"$f":"IF(AND($E26<>NAErr,$C26<>NAErr),$D26*PI()*($C26/200)^2,NAErr)","v":0.78703078125557069},{"$f":"IF($C26=NAErr,NAErr,SUM(IF(trUtil,(trDbh>$C26)*trBaHa,0)))","v":2.0747993970181176},{"$f":"IF($C26=NAErr,NAErr,SUM(IF(trUtil,(trDbh>$C26)*trBaHa*(trSppgrp=\"Con\"),0)))","v":0},{"$f":"IF($C26=NAErr,NAErr,SUM(IF(trUtil,(trDbh>$C26)*trBaHa*(trSppgrp=\"Dec\"),0)))","v":2.0747993970181176},{"$f":"IF(ISERROR($O26),NAErr,INDEX(INDIRECT(\"SpeciesList!SppGrp\"),$O26))","v":"Dec"},{"$f":"IF(ISERROR($O26),NAErr,INDEX(INDIRECT(\"SpeciesList!MGM\"),$O26))","v":"Aw"},{"$f":"IF($C26<>NAErr,PERCENTRANK(trDbh,$C26),NAErr)","v":0.92300000000000004},{"$f":"volest($O26 - 1, $C26, $E26)","v":2.4647746782632991},{"$f":"isutilized($O26, $C26)","v":true},{"$f":"ROUND(VRF($B26),3)","v":1},{"$f":"isjuveniletree($C26)","v":false},{"$f":"SUM(IF(trUtil,(trDbh>$C26)*trBaHa*(trMGMSpp=\"Sw\"),0))","v":0},{"$f":"SUM(IF(trUtil,(trDbh>$C26)*trBaHa*(trMGMSpp=\"Pl\"),0))","v":0},{"$f":"SUM(IF(trUtil,(trDbh>$C26)*trDbh*trpha*(trSppgrp=\"Dec\"),0))","v":485.18996180888502},{"$f":"SUM(IF(trUtil,(trDbh>$C26)*trDbh*trpha*(trMGMSpp=\"Sw\"),0))","v":0},{"$f":"SUM(IF(trUtil,(trDbh>$C26)*trDbh*trpha*(trMGMSpp=\"Pl\"),0))","v":0},{"$f":"SUM(IF(trUtil,(trDbh>$C26)*trDbh*trpha*(trMGMSpp=\"Sb\"),0))","v":0},{"$f":"IF(AND(($C26-$L26)>0,$L26>0),$AE26-MAX(0,volest($O26-1,$C26-$L26,$E26-$M26)),0)","v":1.1174450497678734E-2},-1,-1,-1,-1,-1,-1,-1,-1,-1,-1,-1,-1,-1,-1,-1,-1,-1,-1,-1,40]
[14,"AW",46.235442499779076,4.7232218062253972,33.936218333931286,198.57772452362082,196.62107749691998,0.25021927393500176,6.4714374072811598,74,97,9.6145176205107E-2,2.7899133176199992E-2,0.97976851743556037,3,3,799.04004526439587,163.21420477984034,126.2286677166786,13.527445016847857,1102.0103627777626,{"$f":"IF(AND(NAErr<>$L27,NAErr<>$M27),$M27/$L27,NAErr)","v":0.29017714957100527},{"$f":"IF(AND($E27<>NAErr,$C27<>NAErr),$E27/$C27,NAErr)","v":0.73398709948744278},{"$f":"IF(AND($E27<>NAErr,$C27<>NAErr),$D27*PI()*($C27/200)^2,NAErr)","v":0.79300926087306689},{"$f":"IF($C27=NAErr,NAErr,SUM(IF(trUtil,(trDbh>$C27)*trBaHa,0)))","v":2.8618301782736881},{"$f":"IF($C27=NAErr,NAErr,SUM(IF(trUtil,(trDbh>$C27)*trBaHa*(trSppgrp=\"Con\"),0)))","v":0},{"$f":"IF($C27=NAErr,NAErr,SUM(IF(trUtil,(trDbh>$C27)*trBaHa*(trSppgrp=\"Dec\"),0)))","v":2.8618301782736881},{"$f":"IF(ISERROR($O27),NAErr,INDEX(INDIRECT(\"SpeciesList!SppGrp\"),$O27))","v":"Dec"},{"$f":"IF(ISERROR($O27),NAErr,INDEX(INDIRECT(\"SpeciesList!MGM\"),$O27))","v":"Aw"},{"$f":"IF($C27<>NAErr,PERCENTRANK(trDbh,$C27),NAErr)","v":0.90700000000000003},{"$f":"volest($O27 - 1, $C27, $E27)","v":2.2377583754017163},{"$f":"isutilized($O27, $C27)","v":true},{"$f":"ROUND(VRF($B27),3)","v":1},{"$f":"isjuveniletree($C27)","v":false},{"$f":"SUM(IF(trUtil,(trDbh>$C27)*trBaHa*(trMGMSpp=\"Sw\"),0))","v":0},{"$f":"SUM(IF(trUtil,(trDbh>$C27)*trBaHa*(trMGMSpp=\"Pl\"),0))","v":0},{"$f":"SUM(IF(trUtil,(trDbh>$C27)*trDbh*trpha*(trSppgrp=\"Dec\"),0))","v":692.15353354616877},{"$f":"SUM(IF(trUtil,(trDbh>$C27)*trDbh*trpha*(trMGMSpp=\"Sw\"),0))","v":0},{"$f":"SUM(IF(trUtil,(trDbh>$C27)*trDbh*trpha*(trMGMSpp=\"Pl\"),0))","v":0},{"$f":"SUM(IF(trUtil,(trDbh>$C27)*trDbh*trpha*(trMGMSpp=\"Sb\"),0))","v":0},{"$f":"IF(AND(($C27-$L27)>0,$L27>0),$AE27-MAX(0,volest($O27-1,$C27-$L27,$E27-$M27)),0)","v":1.0506269384136235E-2},-1,-1,-1,-1,-1,-1,-1,-1,-1,-1,-1,-1,-1,-1,-1,-1,-1,-1,-1,14]
[15,"AW",44.395948989259409,4.8868949809442972,33.452542232693425,198.26407261315529,196.30742558645449,0.25211969244767557,6.3705163636760886,24,44,9.5782596524311786E-2,2.7969515034817257E-2,0.98195433867081838,3,3,722.65356645994927,148.09208771816654,113.94663223315909,12.661031664691281,997.35331807596629,{"$f":"IF(AND(NAErr<>$L28,NAErr<>$M28),$M28/$L28,NAErr)","v":0.29201040742007828},{"$f":"IF(AND($E28<>NAErr,$C28<>NAErr),$E28/$C28,NAErr)","v":0.75350438484345739},{"$f":"IF(AND($E28<>NAErr,$C28<>NAErr),$D28*PI()*($C28/200)^2,NAErr)","v":0.7565011193794634},{"$f":"IF($C28=NAErr,NAErr,SUM(IF(trUtil,(trDbh>$C28)*trBaHa,0)))","v":3.6548394391467549},{"$f":"IF($C28=NAErr,NAErr,SUM(IF(trUtil,(trDbh>$C28)*trBaHa*(trSppgrp=\"Con\"),0)))","v":0},{"$f":"IF($C28=NAErr,NAErr,SUM(IF(trUtil,(trDbh>$C28)*trBaHa*(trSppgrp=\"Dec\"),0)))","v":3.6548394391467549},{"$f":"IF(ISERROR($O28),NAErr,INDEX(INDIRECT(\"SpeciesList!SppGrp\"),$O28))","v":"Dec"},{"$f":"IF(ISERROR($O28),NAErr,INDEX(INDIRECT(\"SpeciesList!MGM\"),$O28))","v":"Aw"},{"$f":"IF($C28<>NAErr,PERCENTRANK(trDbh,$C28),NAErr)","v":0.89200000000000002},{"$f":"volest($O28 - 1, $C28, $E28)","v":2.0448147615938961},{"$f":"isutilized($O28, $C28)","v":true},{"$f":"ROUND(VRF($B28),3)","v":1},{"$f":"isjuveniletree($C28)","v":false},{"$f":"SUM(IF(trUtil,(trDbh>$C28)*trBaHa*(trMGMSpp=\"Sw\"),0))","v":0},{"$f":"SUM(IF(trUtil,(trDbh>$C28)*trBaHa*(trMGMSpp=\"Pl\"),0))","v":0},{"$f":"SUM(IF(trUtil,(trDbh>$C28)*trDbh*trpha*(trSppgrp=\"Dec\"),0))","v":910.53378378160573},{"$f":"SUM(IF(trUtil,(trDbh>$C28)*trDbh*trpha*(trMGMSpp=\"Sw\"),0))","v":0},{"$f":"SUM(IF(trUtil,(trDbh>$C28)*trDbh*trpha*(trMGMSpp=\"Pl\"),0))","v":0},{"$f":"SUM(IF(trUtil,(trDbh>$C28)*trDbh*trpha*(trMGMSpp=\"Sb\"),0))","v":0},{"$f":"IF(AND(($C28-$L28)>0,$L28>0),$AE28-MAX(0,volest($O28-1,$C28-$L28,$E28-$M28)),0)","v":9.9468767222758991E-3},-1,-1,-1,-1,-1,-1,-1,-1,-1,-1,-1,-1,-1,-1,-1,-1,-1,-1,-1,15]
[29,"AW",43.174507426558833,4.8846855968073939,32.875050287696624,197.7357951782746,195.77914815157376,0.25506966185340652,6.2967740542430555,6,70,9.5595458642652564E-2,2.8088829264614021E-2,0.9830854302765466,3,3,674.43976514031397,138.52091815253078,106.20680195623881,12.098046414401683,931.26553166348526,{"$f":"IF(AND(NAErr<>$L29,NAErr<>$M29),$M29/$L29,NAErr)","v":0.29383016372789711},{"$f":"IF(AND($E29<>NAErr,$C29<>NAErr),$E29/$C29,NAErr)","v":0.76144586811136405},{"$f":"IF(AND($E29<>NAErr,$C29<>NAErr),$D29*PI()*($C29/200)^2,NAErr)","v":0.71512387870981731},{"$f":"IF($C29=NAErr,NAErr,SUM(IF(trUtil,(trDbh>$C29)*trBaHa,0)))","v":4.4113405585262182},{"$f":"IF($C29=NAErr,NAErr,SUM(IF(trUtil,(trDbh>$C29)*trBaHa*(trSppgrp=\"Con\"),0)))","v":0},{"$f":"IF($C29=NAErr,NAErr,SUM(IF(trUtil,(trDbh>$C29)*trBaHa*(trSppgrp=\"Dec\"),0)))","v":4.4113405585262182},{"$f":"IF(ISERROR($O29),NAErr,INDEX(INDIRECT(\"SpeciesList!SppGrp\"),$O29))","v":"Dec"},{"$f":"IF(ISERROR($O29),NAErr,INDEX(INDIRECT(\"SpeciesList!MGM\"),$O29))","v":"Aw"},{"$f":"IF($C29<>NAErr,PERCENTRANK(trDbh,$C29),NAErr)","v":0.876},{"$f":"volest($O29 - 1, $C29, $E29)","v":1.9070694228004981},{"$f":"isutilized($O29, $C29)","v":true},{"$f":"ROUND(VRF($B29),3)","v":1},{"$f":"isjuveniletree($C29)","v":false},{"$f":"SUM(IF(trUtil,(trDbh>$C29)*trBaHa*(trMGMSpp=\"Sw\"),0))","v":0},{"$f":"SUM(IF(trUtil,(trDbh>$C29)*trBaHa*(trMGMSpp=\"Pl\"),0))","v":0},{"$f":"SUM(IF(trUtil,(trDbh>$C29)*trDbh*trpha*(trSppgrp=\"Dec\"),0))","v":1127.4921240714766},{"$f":"SUM(IF(trUtil,(trDbh>$C29)*trDbh*trpha*(trMGMSpp=\"Sw\"),0))","v":0},{"$f":"SUM(IF(trUtil,(trDbh>$C29)*trDbh*trpha*(trMGMSpp=\"Pl\"),0))","v":0},{"$f":"SUM(IF(trUtil,(trDbh>$C29)*trDbh*trpha*(trMGMSpp=\"Sb\"),0))","v":0},{"$f":"IF(AND(($C29-$L29)>0,$L29>0),$AE29-MAX(0,volest($O29-1,$C29-$L29,$E29-$M29)),0)","v":9.5268054607615671E-3},-1,-1,-1,-1,-1,-1,-1,-1,-1,-1,-1,-1,-1,-1,-1,-1,-1,-1,-1,29]
[21,"AW",40.522361304058741,4.9066054056941022,32.326311963618238,198.38805429573745,196.43140726903664,0.25524408837928292,6.1181635861027868,91,55,9.4506034703402464E-2,2.7935735622912218E-2,0.98517254434694812,3,3,576.50073751666139,119.00834762602383,90.517284286134412,10.910031857222256,796.93640128604193,{"$f":"IF(AND(NAErr<>$L30,NAErr<>$M30),$M30/$L30,NAErr)","v":0.29559737333796376},{"$f":"IF(AND($E30<>NAErr,$C30<>NAErr),$E30/$C30,NAErr)","v":0.79774008530890861},{"$f":"IF(AND($E30<>NAErr,$C30<>NAErr),$D30*PI()*($C30/200)^2,NAErr)","v":0.63279130538869033},{"$f":"IF($C30=NAErr,NAErr,SUM(IF(trUtil,(trDbh>$C30)*trBaHa,0)))","v":5.1264644372360353},{"$f":"IF($C30=NAErr,NAErr,SUM(IF(trUtil,(trDbh>$C30)*trBaHa*(trSppgrp=\"Con\"),0)))","v":0},{"$f":"IF($C30=NAErr,NAErr,SUM(IF(trUtil,(trDbh>$C30)*trBaHa*(trSppgrp=\"Dec\"),0)))","v":5.1264644372360353},{"$f":"IF(ISERROR($O30),NAErr,INDEX(INDIRECT(\"SpeciesList!SppGrp\"),$O30))","v":"Dec"},{"$f":"IF(ISERROR($O30),NAErr,INDEX(INDIRECT(\"SpeciesList!MGM\"),$O30))","v":"Aw"},{"$f":"IF($C30<>NAErr,PERCENTRANK(trDbh,$C30),NAErr)","v":0.86099999999999999},{"$f":"volest($O30 - 1, $C30, $E30)","v":1.665026816564642},{"$f":"isutilized($O30, $C30)","v":true},{"$f":"ROUND(VRF($B30),3)","v":1},{"$f":"isjuveniletree($C30)","v":false},{"$f":"SUM(IF(trUtil,(trDbh>$C30)*trBaHa*(trMGMSpp=\"Sw\"),0))","v":0},{"$f":"SUM(IF(trUtil,(trDbh>$C30)*trBaHa*(trMGMSpp=\"Pl\"),0))","v":0},{"$f":"SUM(IF(trUtil,(trDbh>$C30)*trDbh*trpha*(trSppgrp=\"Dec\"),0))","v":1338.3860186472425},{"$f":"SUM(IF(trUtil,(trDbh>$C30)*trDbh*trpha*(trMGMSpp=\"Sw\"),0))","v":0},{"$f":"SUM(IF(trUtil,(trDbh>$C30)*trDbh*trpha*(trMGMSpp=\"Pl\"),0))","v":0},{"$f":"SUM(IF(trUtil,(trDbh>$C30)*trDbh*trpha*(trMGMSpp=\"Sb\"),0))","v":0},{"$f":"IF(AND(($C30-$L30)>0,$L30>0),$AE30-MAX(0,volest($O30-1,$C30-$L30,$E30-$M30)),0)","v":8.7280391292547943E-3},-1,-1,-1,-1,-1,-1,-1,-1,-1,-1,-1,-1,-1,-1,-1,-1,-1,-1,-1,21]
[9,"AW",39.044253913696096,4.7803618421761218,31.205027471928563,197.06627635373138,195.10962932703058,0.26146882371589353,6.0076305785668378,2,70,9.4990878955673902E-2,2.8236829612017521E-2,0.98599362224916942,3,3,525.84683887796086,108.87532103353151,82.421806795571129,10.268694878389121,727.41266158545261,{"$f":"IF(AND(NAErr<>$L31,NAErr<>$M31),$M31/$L31,NAErr)","v":0.29725832545663489},{"$f":"IF(AND($E31<>NAErr,$C31<>NAErr),$E31/$C31,NAErr)","v":0.7992220197344414},{"$f":"IF(AND($E31<>NAErr,$C31<>NAErr),$D31*PI()*($C31/200)^2,NAErr)","v":0.5723542464713457},{"$f":"IF($C31=NAErr,NAErr,SUM(IF(trUtil,(trDbh>$C31)*trBaHa,0)))","v":5.7592557426247257},{"$f":"IF($C31=NAErr,NAErr,SUM(IF(trUtil,(trDbh>$C31)*trBaHa*(trSppgrp=\"Con\"),0)))","v":0},{"$f":"IF($C31=NAErr,NAErr,SUM(IF(trUtil,(trDbh>$C31)*trBaHa*(trSppgrp=\"Dec\"),0)))","v":5.7592557426247257},{"$f":"IF(ISERROR($O31),NAErr,INDEX(INDIRECT(\"SpeciesList!SppGrp\"),$O31))","v":"Dec"},{"$f":"IF(ISERROR($O31),NAErr,INDEX(INDIRECT(\"SpeciesList!MGM\"),$O31))","v":"Aw"},{"$f":"IF($C31<>NAErr,PERCENTRANK(trDbh,$C31),NAErr)","v":0.84599999999999997},{"$f":"volest($O31 - 1, $C31, $E31)","v":1.4982157337372368},{"$f":"isutilized($O31, $C31)","v":true},{"$f":"ROUND(VRF($B31),3)","v":1},{"$f":"isjuveniletree($C31)","v":false},{"$f":"SUM(IF(trUtil,(trDbh>$C31)*trBaHa*(trMGMSpp=\"Sw\"),0))","v":0},{"$f":"SUM(IF(trUtil,(trDbh>$C31)*trBaHa*(trMGMSpp=\"Pl\"),0))","v":0},{"$f":"SUM(IF(trUtil,(trDbh>$C31)*trDbh*trpha*(trSppgrp=\"Dec\"),0))","v":1537.2132556732267},{"$f":"SUM(IF(trUtil,(trDbh>$C31)*trDbh*trpha*(trMGMSpp=\"Sw\"),0))","v":0},{"$f":"SUM(IF(trUtil,(trDbh>$C31)*trDbh*trpha*(trMGMSpp=\"Pl\"),0))","v":0},{"$f":"SUM(IF(trUtil,(trDbh>$C31)*trDbh*trpha*(trMGMSpp=\"Sb\"),0))","v":0},{"$f":"IF(AND(($C31-$L31)>0,$L31>0),$AE31-MAX(0,volest($O31-1,$C31-$L31,$E31-$M31)),0)","v":8.2111881864186387E-3},-1,-1,-1,-1,-1,-1,-1,-1,-1,-1,-1,-1,-1,-1,-1,-1,-1,-1,-1,8]
[8,"AW",38.157577581336227,4.6725729297154892,31.298123184359273,198.09324320288209,196.13659617618129,0.25874099631238529,5.9375506043550494,46,90,9.3685662769314559E-2,2.7994517410503156E-2,0.98636572520506449,3,3,496.78427966650645,103.04742166101585,77.783558153923352,9.8912194406155027,687.50647892206109,{"$f":"IF(AND(NAErr<>$L32,NAErr<>$M32),$M32/$L32,NAErr)","v":0.29881325042696255},{"$f":"IF(AND($E32<>NAErr,$C32<>NAErr),$E32/$C32,NAErr)","v":0.8202334940588033},{"$f":"IF(AND($E32<>NAErr,$C32<>NAErr),$D32*PI()*($C32/200)^2,NAErr)","v":0.53432754348362133},{"$f":"IF($C32=NAErr,NAErr,SUM(IF(trUtil,(trDbh>$C32)*trBaHa,0)))","v":6.3316099890960711},{"$f":"IF($C32=NAErr,NAErr,SUM(IF(trUtil,(trDbh>$C32)*trBaHa*(trSppgrp=\"Con\"),0)))","v":0},{"$f":"IF($C32=NAErr,NAErr,SUM(IF(trUtil,(trDbh>$C32)*trBaHa*(trSppgrp=\"Dec\"),0)))","v":6.3316099890960711},{"$f":"IF(ISERROR($O32),NAErr,INDEX(INDIRECT(\"SpeciesList!SppGrp\"),$O32))","v":"Dec"},{"$f":"IF(ISERROR($O32),NAErr,INDEX(INDIRECT(\"SpeciesList!MGM\"),$O32))","v":"Aw"},{"$f":"IF($C32<>NAErr,PERCENTRANK(trDbh,$C32),NAErr)","v":0.83},{"$f":"volest($O32 - 1, $C32, $E32)","v":1.4392245574843567},{"$f":"isutilized($O32, $C32)","v":true},{"$f":"ROUND(VRF($B32),3)","v":1},{"$f":"isjuveniletree($C32)","v":false},{"$f":"SUM(IF(trUtil,(trDbh>$C32)*trBaHa*(trMGMSpp=\"Sw\"),0))","v":0},{"$f":"SUM(IF(trUtil,(trDbh>$C32)*trBaHa*(trMGMSpp=\"Pl\"),0))","v":0},{"$f":"SUM(IF(trUtil,(trDbh>$C32)*trDbh*trpha*(trSppgrp=\"Dec\"),0))","v":1723.8589172384952},{"$f":"SUM(IF(trUtil,(trDbh>$C32)*trDbh*trpha*(trMGMSpp=\"Sw\"),0))","v":0},{"$f":"SUM(IF(trUtil,(trDbh>$C32)*trDbh*trpha*(trMGMSpp=\"Pl\"),0))","v":0},{"$f":"SUM(IF(trUtil,(trDbh>$C32)*trDbh*trpha*(trMGMSpp=\"Sb\"),0))","v":0},{"$f":"IF(AND(($C32-$L32)>0,$L32>0),$AE32-MAX(0,volest($O32-1,$C32-$L32,$E32-$M32)),0)","v":7.9416801822378424E-3},-1,-1,-1,-1,-1,-1,-1,-1,-1,-1,-1,-1,-1,-1,-1,-1,-1,-1,-1,9]
[22,"AW",35.143645461380068,4.2712537712068572,30.185204067221505,197.64488934583355,195.68824231913271,0.26031716245190539,5.6781782412135318,34,56,9.3548648014792887E-2,2.8092107972381545E-2,0.9874896805404797,3,3,405.25298917997037,84.617035216689828,63.210340706722221,8.649462990148411,561.72982809353084,{"$f":"IF(AND(NAErr<>$L33,NAErr<>$M33),$M33/$L33,NAErr)","v":0.30029410973357229},{"$f":"IF(AND($E33<>NAErr,$C33<>NAErr),$E33/$C33,NAErr)","v":0.85890930411281674},{"$f":"IF(AND($E33<>NAErr,$C33<>NAErr),$D33*PI()*($C33/200)^2,NAErr)","v":0.41432283971826228},{"$f":"IF($C33=NAErr,NAErr,SUM(IF(trUtil,(trDbh>$C33)*trBaHa,0)))","v":6.8659375325796921},{"$f":"IF($C33=NAErr,NAErr,SUM(IF(trUtil,(trDbh>$C33)*trBaHa*(trSppgrp=\"Con\"),0)))","v":0},{"$f":"IF($C33=NAErr,NAErr,SUM(IF(trUtil,(trDbh>$C33)*trBaHa*(trSppgrp=\"Dec\"),0)))","v":6.8659375325796921},{"$f":"IF(ISERROR($O33),NAErr,INDEX(INDIRECT(\"SpeciesList!SppGrp\"),$O33))","v":"Dec"},{"$f":"IF(ISERROR($O33),NAErr,INDEX(INDIRECT(\"SpeciesList!MGM\"),$O33))","v":"Aw"},{"$f":"IF($C33<>NAErr,PERCENTRANK(trDbh,$C33),NAErr)","v":0.81499999999999995},{"$f":"volest($O33 - 1, $C33, $E33)","v":1.1879482209474812},{"$f":"isutilized($O33, $C33)","v":true},{"$f":"ROUND(VRF($B33),3)","v":1},{"$f":"isjuveniletree($C33)","v":false},{"$f":"SUM(IF(trUtil,(trDbh>$C33)*trBaHa*(trMGMSpp=\"Sw\"),0))","v":0},{"$f":"SUM(IF(trUtil,(trDbh>$C33)*trBaHa*(trMGMSpp=\"Pl\"),0))","v":0},{"$f":"SUM(IF(trUtil,(trDbh>$C33)*trDbh*trpha*(trSppgrp=\"Dec\"),0))","v":1902.1529813085656},{"$f":"SUM(IF(trUtil,(trDbh>$C33)*trDbh*trpha*(trMGMSpp=\"Sw\"),0))","v":0},{"$f":"SUM(IF(trUtil,(trDbh>$C33)*trDbh*trpha*(trMGMSpp=\"Pl\"),0))","v":0},{"$f":"SUM(IF(trUtil,(trDbh>$C33)*trDbh*trpha*(trMGMSpp=\"Sb\"),0))","v":0},{"$f":"IF(AND(($C33-$L33)>0,$L33>0),$AE33-MAX(0,volest($O33-1,$C33-$L33,$E33-$M33)),0)","v":7.0846510349045211E-3},-1,-1,-1,-1,-1,-1,-1,-1,-1,-1,-1,-1,-1,-1,-1,-1,-1,-1,-1,22]
[28,"AW",33.14618973206688,3.9419860502494939,29.482987489690295,197.62476246642279,195.66811543972196,0.26016320000846499,5.4882635528330637,24,38,9.3160172891522675E-2,2.8091079173794518E-2,0.98791353824215211,3,3,350.6134436163162,73.552212146116531,54.539518091915077,7.86240603762392,486.56757989197172,{"$f":"IF(AND(NAErr<>$L34,NAErr<>$M34),$M34/$L34,NAErr)","v":0.3015352838224577},{"$f":"IF(AND($E34<>NAErr,$C34<>NAErr),$E34/$C34,NAErr)","v":0.88948345882324253},{"$f":"IF(AND($E34<>NAErr,$C34<>NAErr),$D34*PI()*($C34/200)^2,NAErr)","v":0.3401513417421308},{"$f":"IF($C34=NAErr,NAErr,SUM(IF(trUtil,(trDbh>$C34)*trBaHa,0)))","v":7.2802603722979544},{"$f":"IF($C34=NAErr,NAErr,SUM(IF(trUtil,(trDbh>$C34)*trBaHa*(trSppgrp=\"Con\"),0)))","v":0},{"$f":"IF($C34=NAErr,NAErr,SUM(IF(trUtil,(trDbh>$C34)*trBaHa*(trSppgrp=\"Dec\"),0)))","v":7.2802603722979544},{"$f":"IF(ISERROR($O34),NAErr,INDEX(INDIRECT(\"SpeciesList!SppGrp\"),$O34))","v":"Dec"},{"$f":"IF(ISERROR($O34),NAErr,INDEX(INDIRECT(\"SpeciesList!MGM\"),$O34))","v":"Aw"},{"$f":"IF($C34<>NAErr,PERCENTRANK(trDbh,$C34),NAErr)","v":0.8},{"$f":"volest($O34 - 1, $C34, $E34)","v":1.0383339243883261},{"$f":"isutilized($O34, $C34)","v":true},{"$f":"ROUND(VRF($B34),3)","v":1},{"$f":"isjuveniletree($C34)","v":false},{"$f":"SUM(IF(trUtil,(trDbh>$C34)*trBaHa*(trMGMSpp=\"Sw\"),0))","v":0},{"$f":"SUM(IF(trUtil,(trDbh>$C34)*trBaHa*(trMGMSpp=\"Pl\"),0))","v":0},{"$f":"SUM(IF(trUtil,(trDbh>$C34)*trDbh*trpha*(trSppgrp=\"Dec\"),0))","v":2052.260409519442},{"$f":"SUM(IF(trUtil,(trDbh>$C34)*trDbh*trpha*(trMGMSpp=\"Sw\"),0))","v":0},{"$f":"SUM(IF(trUtil,(trDbh>$C34)*trDbh*trpha*(trMGMSpp=\"Pl\"),0))","v":0},{"$f":"SUM(IF(trUtil,(trDbh>$C34)*trDbh*trpha*(trMGMSpp=\"Sb\"),0))","v":0},{"$f":"IF(AND(($C34-$L34)>0,$L34>0),$AE34-MAX(0,volest($O34-1,$C34-$L34,$E34-$M34)),0)","v":6.5221216507449498E-3},-1,-1,-1,-1,-1,-1,-1,-1,-1,-1,-1,-1,-1,-1,-1,-1,-1,-1,-1,28]
[73,"SW",31.71650770219831,4.4966112506146239,29.115142376342419,197.70081844831483,191.03815782227556,0.47923480684091974,3.9213517240066409,1,22,5.3277217886011023E-2,4.0843027207690008E-2,0.99431225911617871,1,1,265.86273435628607,33.167836796729546,37.836673131997358,25.51390633319787,362.38115061821088,{"$f":"IF(AND(NAErr<>$L35,NAErr<>$M35),$M35/$L35,NAErr)","v":0.76661336361586074},{"$f":"IF(AND($E35<>NAErr,$C35<>NAErr),$E35/$C35,NAErr)","v":0.91798071369391065},{"$f":"IF(AND($E35<>NAErr,$C35<>NAErr),$D35*PI()*($C35/200)^2,NAErr)","v":0.35525970148282177},{"$f":"IF($C35=NAErr,NAErr,SUM(IF(trUtil,(trDbh>$C35)*trBaHa,0)))","v":7.6204117140400855},{"$f":"IF($C35=NAErr,NAErr,SUM(IF(trUtil,(trDbh>$C35)*trBaHa*(trSppgrp=\"Con\"),0)))","v":0},{"$f":"IF($C35=NAErr,NAErr,SUM(IF(trUtil,(trDbh>$C35)*trBaHa*(trSppgrp=\"Dec\"),0)))","v":7.6204117140400855},{"$f":"IF(ISERROR($O35),NAErr,INDEX(INDIRECT(\"SpeciesList!SppGrp\"),$O35))","v":"Con"},{"$f":"IF(ISERROR($O35),NAErr,INDEX(INDIRECT(\"SpeciesList!MGM\"),$O35))","v":"Sw"},{"$f":"IF($C35<>NAErr,PERCENTRANK(trDbh,$C35),NAErr)","v":0.78400000000000003},{"$f":"volest($O35 - 1, $C35, $E35)","v":0.91676567432196765},{"$f":"isutilized($O35, $C35)","v":true},{"$f":"ROUND(VRF($B35),3)","v":1},{"$f":"isjuveniletree($C35)","v":false},{"$f":"SUM(IF(trUtil,(trDbh>$C35)*trBaHa*(trMGMSpp=\"Sw\"),0))","v":0},{"$f":"SUM(IF(trUtil,(trDbh>$C35)*trBaHa*(trMGMSpp=\"Pl\"),0))","v":0},{"$f":"SUM(IF(trUtil,(trDbh>$C35)*trDbh*trpha*(trSppgrp=\"Dec\"),0))","v":2182.9222270621726},{"$f":"SUM(IF(trUtil,(trDbh>$C35)*trDbh*trpha*(trMGMSpp=\"Sw\"),0))","v":0},{"$f":"SUM(IF(trUtil,(trDbh>$C35)*trDbh*trpha*(trMGMSpp=\"Pl\"),0))","v":0},{"$f":"SUM(IF(trUtil,(trDbh>$C35)*trDbh*trpha*(trMGMSpp=\"Sb\"),0))","v":0},{"$f":"IF(AND(($C35-$L35)>0,$L35>0),$AE35-MAX(0,volest($O35-1,$C35-$L35,$E35-$M35)),0)","v":4.1839173239195393E-3},-1,-1,-1,-1,-1,-1,-1,-1,-1,-1,-1,-1,-1,-1,-1,-1,-1,-1,-1,35]
[62,"SW",31.56223741192569,4.4535817606223427,28.977075008259032,197.35166143242867,190.6890008063894,0.47959595468191374,3.9068503167210147,29,31,5.3126158255535287E-2,4.0838694854642033E-2,0.99428574686514337,1,1,262.54237366262811,32.797599448095283,37.45445728870186,25.332057697522572,358.12648809694781,{"$f":"IF(AND(NAErr<>$L36,NAErr<>$M36),$M36/$L36,NAErr)","v":0.76871161393242649},{"$f":"IF(AND($E36<>NAErr,$C36<>NAErr),$E36/$C36,NAErr)","v":0.9180931830045147},{"$f":"IF(AND($E36<>NAErr,$C36<>NAErr),$D36*PI()*($C36/200)^2,NAErr)","v":0.34844551236362731},{"$f":"IF($C36=NAErr,NAErr,SUM(IF(trUtil,(trDbh>$C36)*trBaHa,0)))","v":7.9756714155229069},{"$f":"IF($C36=NAErr,NAErr,SUM(IF(trUtil,(trDbh>$C36)*trBaHa*(trSppgrp=\"Con\"),0)))","v":0.35525970148282177},{"$f":"IF($C36=NAErr,NAErr,SUM(IF(trUtil,(trDbh>$C36)*trBaHa*(trSppgrp=\"Dec\"),0)))","v":7.6204117140400855},{"$f":"IF(ISERROR($O36),NAErr,INDEX(INDIRECT(\"SpeciesList!SppGrp\"),$O36))","v":"Con"},{"$f":"IF(ISERROR($O36),NAErr,INDEX(INDIRECT(\"SpeciesList!MGM\"),$O36))","v":"Sw"},{"$f":"IF($C36<>NAErr,PERCENTRANK(trDbh,$C36),NAErr)","v":0.76900000000000002},{"$f":"volest($O36 - 1, $C36, $E36)","v":0.9040583760084473},{"$f":"isutilized($O36, $C36)","v":true},{"$f":"ROUND(VRF($B36),3)","v":1},{"$f":"isjuveniletree($C36)","v":false},{"$f":"SUM(IF(trUtil,(trDbh>$C36)*trBaHa*(trMGMSpp=\"Sw\"),0))","v":0.35525970148282177},{"$f":"SUM(IF(trUtil,(trDbh>$C36)*trBaHa*(trMGMSpp=\"Pl\"),0))","v":0},{"$f":"SUM(IF(trUtil,(trDbh>$C36)*trDbh*trpha*(trSppgrp=\"Dec\"),0))","v":2182.9222270621726},{"$f":"SUM(IF(trUtil,(trDbh>$C36)*trDbh*trpha*(trMGMSpp=\"Sw\"),0))","v":142.61680536391029},{"$f":"SUM(IF(trUtil,(trDbh>$C36)*trDbh*trpha*(trMGMSpp=\"Pl\"),0))","v":0},{"$f":"SUM(IF(trUtil,(trDbh>$C36)*trDbh*trpha*(trMGMSpp=\"Sb\"),0))","v":0},{"$f":"IF(AND(($C36-$L36)>0,$L36>0),$AE36-MAX(0,volest($O36-1,$C36-$L36,$E36-$M36)),0)","v":4.1381379216764991E-3},-1,-1,-1,-1,-1,-1,-1,-1,-1,-1,-1,-1,-1,-1,-1,-1,-1,-1,-1,26]
[72,"SW",31.367581952347553,4.3955841486115492,28.722189599627278,196.62646277065949,189.96380214462022,0.48140212389345916,3.88855270352067,31,100,5.3162272914293575E-2,4.0976670997828132E-2,0.99425805326066119,1,1,258.38918528838605,32.333792174638781,36.975061742481799,25.103196148537005,352.80123535404363,{"$f":"IF(AND(NAErr<>$L37,NAErr<>$M37),$M37/$L37,NAErr)","v":0.77078478310905441},{"$f":"IF(AND($E37<>NAErr,$C37<>NAErr),$E37/$C37,NAErr)","v":0.91566476635849536},{"$f":"IF(AND($E37<>NAErr,$C37<>NAErr),$D37*PI()*($C37/200)^2,NAErr)","v":0.33967889385761857},{"$f":"IF($C37=NAErr,NAErr,SUM(IF(trUtil,(trDbh>$C37)*trBaHa,0)))","v":8.3241169278865339},{"$f":"IF($C37=NAErr,NAErr,SUM(IF(trUtil,(trDbh>$C37)*trBaHa*(trSppgrp=\"Con\"),0)))","v":0.70370521384644902},{"$f":"IF($C37=NAErr,NAErr,SUM(IF(trUtil,(trDbh>$C37)*trBaHa*(trSppgrp=\"Dec\"),0)))","v":7.6204117140400855},{"$f":"IF(ISERROR($O37),NAErr,INDEX(INDIRECT(\"SpeciesList!SppGrp\"),$O37))","v":"Con"},{"$f":"IF(ISERROR($O37),NAErr,INDEX(INDIRECT(\"SpeciesList!MGM\"),$O37))","v":"Sw"},{"$f":"IF($C37<>NAErr,PERCENTRANK(trDbh,$C37),NAErr)","v":0.753},{"$f":"volest($O37 - 1, $C37, $E37)","v":0.88566684309110744},{"$f":"isutilized($O37, $C37)","v":true},{"$f":"ROUND(VRF($B37),3)","v":1},{"$f":"isjuveniletree($C37)","v":false},{"$f":"SUM(IF(trUtil,(trDbh>$C37)*trBaHa*(trMGMSpp=\"Sw\"),0))","v":0.70370521384644902},{"$f":"SUM(IF(trUtil,(trDbh>$C37)*trBaHa*(trMGMSpp=\"Pl\"),0))","v":0},{"$f":"SUM(IF(trUtil,(trDbh>$C37)*trDbh*trpha*(trSppgrp=\"Dec\"),0))","v":2182.9222270621726},{"$f":"SUM(IF(trUtil,(trDbh>$C37)*trDbh*trpha*(trMGMSpp=\"Sw\"),0))","v":283.18181022609468},{"$f":"SUM(IF(trUtil,(trDbh>$C37)*trDbh*trpha*(trMGMSpp=\"Pl\"),0))","v":0},{"$f":"SUM(IF(trUtil,(trDbh>$C37)*trDbh*trpha*(trMGMSpp=\"Sb\"),0))","v":0},{"$f":"IF(AND(($C37-$L37)>0,$L37>0),$AE37-MAX(0,volest($O37-1,$C37-$L37,$E37-$M37)),0)","v":4.0892073818717956E-3},-1,-1,-1,-1,-1,-1,-1,-1,-1,-1,-1,-1,-1,-1,-1,-1,-1,-1,-1,16]
[26,"AW",31.349610754899878,3.5512538677012211,28.483436297384095,197.53483297575877,195.57818594905797,0.26270722122383905,5.3051785744974529,74,20,5.438223003130379E-2,2.8062735978212985E-2,0.98801205687650673,3,3,305.4428427526164,64.36290900900984,47.390330477817507,7.1795530587515435,424.37563529819528,{"$f":"IF(AND(NAErr<>$L38,NAErr<>$M38),$M38/$L38,NAErr)","v":0.51602767966777685},{"$f":"IF(AND($E38<>NAErr,$C38<>NAErr),$E38/$C38,NAErr)","v":0.90857384227433169},{"$f":"IF(AND($E38<>NAErr,$C38<>NAErr),$D38*PI()*($C38/200)^2,NAErr)","v":0.27411696005174851},{"$f":"IF($C38=NAErr,NAErr,SUM(IF(trUtil,(trDbh>$C38)*trBaHa,0)))","v":8.6637958217441522},{"$f":"IF($C38=NAErr,NAErr,SUM(IF(trUtil,(trDbh>$C38)*trBaHa*(trSppgrp=\"Con\"),0)))","v":1.0433841077040675},{"$f":"IF($C38=NAErr,NAErr,SUM(IF(trUtil,(trDbh>$C38)*trBaHa*(trSppgrp=\"Dec\"),0)))","v":7.6204117140400855},{"$f":"IF(ISERROR($O38),NAErr,INDEX(INDIRECT(\"SpeciesList!SppGrp\"),$O38))","v":"Dec"},{"$f":"IF(ISERROR($O38),NAErr,INDEX(INDIRECT(\"SpeciesList!MGM\"),$O38))","v":"Aw"},{"$f":"IF($C38<>NAErr,PERCENTRANK(trDbh,$C38),NAErr)","v":0.73799999999999999},{"$f":"volest($O38 - 1, $C38, $E38)","v":0.90204487032517422},{"$f":"isutilized($O38, $C38)","v":true},{"$f":"ROUND(VRF($B38),3)","v":1},{"$f":"isjuveniletree($C38)","v":false},{"$f":"SUM(IF(trUtil,(trDbh>$C38)*trBaHa*(trMGMSpp=\"Sw\"),0))","v":1.0433841077040675},{"$f":"SUM(IF(trUtil,(trDbh>$C38)*trBaHa*(trMGMSpp=\"Pl\"),0))","v":0},{"$f":"SUM(IF(trUtil,(trDbh>$C38)*trDbh*trpha*(trSppgrp=\"Dec\"),0))","v":2182.9222270621726},{"$f":"SUM(IF(trUtil,(trDbh>$C38)*trDbh*trpha*(trMGMSpp=\"Sw\"),0))","v":421.06065623610732},{"$f":"SUM(IF(trUtil,(trDbh>$C38)*trDbh*trpha*(trMGMSpp=\"Pl\"),0))","v":0},{"$f":"SUM(IF(trUtil,(trDbh>$C38)*trDbh*trpha*(trMGMSpp=\"Sb\"),0))","v":0},{"$f":"IF(AND(($C38-$L38)>0,$L38>0),$AE38-MAX(0,volest($O38-1,$C38-$L38,$E38-$M38)),0)","v":3.8687473864469357E-3},-1,-1,-1,-1,-1,-1,-1,-1,-1,-1,-1,-1,-1,-1,-1,-1,-1,-1,-1,2]
[58,"SW",31.280337904673377,4.2984089049033019,27.930831331568047,194.03234448900804,187.36968386296877,0.49391140755032925,3.8803517630392976,13,7,5.4081431463962354E-2,4.1774342623861482E-2,0.99421998198392969,1,1,256.54087667443724,32.12712691084451,36.761239508653155,25.000835832685901,350.43007892662081,{"$f":"IF(AND(NAErr<>$L39,NAErr<>$M39),$M39/$L39,NAErr)","v":0.7724341145019098},{"$f":"IF(AND($E39<>NAErr,$C39<>NAErr),$E39/$C39,NAErr)","v":0.89291974455925227},{"$f":"IF(AND($E39<>NAErr,$C39<>NAErr),$D39*PI()*($C39/200)^2,NAErr)","v":0.3303242673200717},{"$f":"IF($C39=NAErr,NAErr,SUM(IF(trUtil,(trDbh>$C39)*trBaHa,0)))","v":8.9379127817958999},{"$f":"IF($C39=NAErr,NAErr,SUM(IF(trUtil,(trDbh>$C39)*trBaHa*(trSppgrp=\"Con\"),0)))","v":1.0433841077040675},{"$f":"IF($C39=NAErr,NAErr,SUM(IF(trUtil,(trDbh>$C39)*trBaHa*(trSppgrp=\"Dec\"),0)))","v":7.8945286740918341},{"$f":"IF(ISERROR($O39),NAErr,INDEX(INDIRECT(\"SpeciesList!SppGrp\"),$O39))","v":"Con"},{"$f":"IF(ISERROR($O39),NAErr,INDEX(INDIRECT(\"SpeciesList!MGM\"),$O39))","v":"Sw"},{"$f":"IF($C39<>NAErr,PERCENTRANK(trDbh,$C39),NAErr)","v":0.72299999999999998},{"$f":"volest($O39 - 1, $C39, $E39)","v":0.85645562291607868},{"$f":"isutilized($O39, $C39)","v":true},{"$f":"ROUND(VRF($B39),3)","v":1},{"$f":"isjuveniletree($C39)","v":false},{"$f":"SUM(IF(trUtil,(trDbh>$C39)*trBaHa*(trMGMSpp=\"Sw\"),0))","v":1.0433841077040675},{"$f":"SUM(IF(trUtil,(trDbh>$C39)*trBaHa*(trMGMSpp=\"Pl\"),0))","v":0},{"$f":"SUM(IF(trUtil,(trDbh>$C39)*trDbh*trpha*(trSppgrp=\"Dec\"),0))","v":2294.2526535064385},{"$f":"SUM(IF(trUtil,(trDbh>$C39)*trDbh*trpha*(trMGMSpp=\"Sw\"),0))","v":421.06065623610732},{"$f":"SUM(IF(trUtil,(trDbh>$C39)*trDbh*trpha*(trMGMSpp=\"Pl\"),0))","v":0},{"$f":"SUM(IF(trUtil,(trDbh>$C39)*trDbh*trpha*(trMGMSpp=\"Sb\"),0))","v":0},{"$f":"IF(AND(($C39-$L39)>0,$L39>0),$AE39-MAX(0,volest($O39-1,$C39-$L39,$E39-$M39)),0)","v":4.0688333218303896E-3},-1,-1,-1,-1,-1,-1,-1,-1,-1,-1,-1,-1,-1,-1,-1,-1,-1,-1,-1,6]
[6,"AW",31.189917486533865,3.3609206396802689,27.297558180880131,196.43008770357054,194.4734406768697,0.27347705484529317,5.2883422969941591,39,77,5.3624133968477157E-2,2.8289461217385292E-2,0.98794795893566068,3,3,301.60642130064946,63.580501793433626,46.784011315948867,7.1200214354993738,419.09095584553137,{"$f":"IF(AND(NAErr<>$L40,NAErr<>$M40),$M40/$L40,NAErr)","v":0.52755092015127358},{"$f":"IF(AND($E40<>NAErr,$C40<>NAErr),$E40/$C40,NAErr)","v":0.8752045654710614},{"$f":"IF(AND($E40<>NAErr,$C40<>NAErr),$D40*PI()*($C40/200)^2,NAErr)","v":0.2567891033033422},{"$f":"IF($C40=NAErr,NAErr,SUM(IF(trUtil,(trDbh>$C40)*trBaHa,0)))","v":9.2682370491159709},{"$f":"IF($C40=NAErr,NAErr,SUM(IF(trUtil,(trDbh>$C40)*trBaHa*(trSppgrp=\"Con\"),0)))","v":1.3737083750241392},{"$f":"IF($C40=NAErr,NAErr,SUM(IF(trUtil,(trDbh>$C40)*trBaHa*(trSppgrp=\"Dec\"),0)))","v":7.8945286740918341},{"$f":"IF(ISERROR($O40),NAErr,INDEX(INDIRECT(\"SpeciesList!SppGrp\"),$O40))","v":"Dec"},{"$f":"IF(ISERROR($O40),NAErr,INDEX(INDIRECT(\"SpeciesList!MGM\"),$O40))","v":"Aw"},{"$f":"IF($C40<>NAErr,PERCENTRANK(trDbh,$C40),NAErr)","v":0.70699999999999996},{"$f":"volest($O40 - 1, $C40, $E40)","v":0.85565746337135895},{"$f":"isutilized($O40, $C40)","v":true},{"$f":"ROUND(VRF($B40),3)","v":1},{"$f":"isjuveniletree($C40)","v":false},{"$f":"SUM(IF(trUtil,(trDbh>$C40)*trBaHa*(trMGMSpp=\"Sw\"),0))","v":1.3737083750241392},{"$f":"SUM(IF(trUtil,(trDbh>$C40)*trBaHa*(trMGMSpp=\"Pl\"),0))","v":0},{"$f":"SUM(IF(trUtil,(trDbh>$C40)*trDbh*trpha*(trSppgrp=\"Dec\"),0))","v":2294.2526535064385},{"$f":"SUM(IF(trUtil,(trDbh>$C40)*trDbh*trpha*(trMGMSpp=\"Sw\"),0))","v":555.51633923393968},{"$f":"SUM(IF(trUtil,(trDbh>$C40)*trDbh*trpha*(trMGMSpp=\"Pl\"),0))","v":0},{"$f":"SUM(IF(trUtil,(trDbh>$C40)*trDbh*trpha*(trMGMSpp=\"Sb\"),0))","v":0},{"$f":"IF(AND(($C40-$L40)>0,$L40>0),$AE40-MAX(0,volest($O40-1,$C40-$L40,$E40-$M40)),0)","v":3.6892790475115955E-3},-1,-1,-1,-1,-1,-1,-1,-1,-1,-1,-1,-1,-1,-1,-1,-1,-1,-1,-1,19]
[79,"SW",31.055993308791546,4.306760643961673,28.388984259004147,195.7865602695685,189.12389964352923,0.48307819985202016,3.8592633710264055,2,43,5.2874179133579689E-2,4.0928070010766537E-2,0.99417850828400678,1,1,251.82525370363646,31.599134353664038,36.214363201163593,24.738232656079163,344.3769839145433,{"$f":"IF(AND(NAErr<>$L41,NAErr<>$M41),$M41/$L41,NAErr)","v":0.77406535063867621},{"$f":"IF(AND($E41<>NAErr,$C41<>NAErr),$E41/$C41,NAErr)","v":0.91412256490175103},{"$f":"IF(AND($E41<>NAErr,$C41<>NAErr),$D41*PI()*($C41/200)^2,NAErr)","v":0.32623568636961842},{"$f":"IF($C41=NAErr,NAErr,SUM(IF(trUtil,(trDbh>$C41)*trBaHa,0)))","v":9.5250261524193132},{"$f":"IF($C41=NAErr,NAErr,SUM(IF(trUtil,(trDbh>$C41)*trBaHa*(trSppgrp=\"Con\"),0)))","v":1.3737083750241392},{"$f":"IF($C41=NAErr,NAErr,SUM(IF(trUtil,(trDbh>$C41)*trBaHa*(trSppgrp=\"Dec\"),0)))","v":8.1513177773951764},{"$f":"IF(ISERROR($O41),NAErr,INDEX(INDIRECT(\"SpeciesList!SppGrp\"),$O41))","v":"Con"},{"$f":"IF(ISERROR($O41),NAErr,INDEX(INDIRECT(\"SpeciesList!MGM\"),$O41))","v":"Sw"},{"$f":"IF($C41<>NAErr,PERCENTRANK(trDbh,$C41),NAErr)","v":0.69199999999999995},{"$f":"volest($O41 - 1, $C41, $E41)","v":0.85901983768382206},{"$f":"isutilized($O41, $C41)","v":true},{"$f":"ROUND(VRF($B41),3)","v":1},{"$f":"isjuveniletree($C41)","v":false},{"$f":"SUM(IF(trUtil,(trDbh>$C41)*trBaHa*(trMGMSpp=\"Sw\"),0))","v":1.3737083750241392},{"$f":"SUM(IF(trUtil,(trDbh>$C41)*trBaHa*(trMGMSpp=\"Pl\"),0))","v":0},{"$f":"SUM(IF(trUtil,(trDbh>$C41)*trDbh*trpha*(trSppgrp=\"Dec\"),0))","v":2399.0794909368547},{"$f":"SUM(IF(trUtil,(trDbh>$C41)*trDbh*trpha*(trMGMSpp=\"Sw\"),0))","v":555.51633923393968},{"$f":"SUM(IF(trUtil,(trDbh>$C41)*trDbh*trpha*(trMGMSpp=\"Pl\"),0))","v":0},{"$f":"SUM(IF(trUtil,(trDbh>$C41)*trDbh*trpha*(trMGMSpp=\"Sb\"),0))","v":0},{"$f":"IF(AND(($C41-$L41)>0,$L41>0),$AE41-MAX(0,volest($O41-1,$C41-$L41,$E41-$M41)),0)","v":3.9925194568457556E-3},-1,-1,-1,-1,-1,-1,-1,-1,-1,-1,-1,-1,-1,-1,-1,-1,-1,-1,-1,1]
[44,"SW",30.713163318011198,4.261523835624784,28.414361215694356,196.44729961782613,189.78463899178686,0.47826851308084956,3.8270373518930527,8,37,5.2260174845480664E-2,4.0556707602128178E-2,0.99414475835046678,1,1,244.72225959050073,30.801833307812682,35.386885772532032,24.338647763204538,335.24962643405001,{"$f":"IF(AND(NAErr<>$L42,NAErr<>$M42),$M42/$L42,NAErr)","v":0.77605380621177589},{"$f":"IF(AND($E42<>NAErr,$C42<>NAErr),$E42/$C42,NAErr)","v":0.92515254522907608},{"$f":"IF(AND($E42<>NAErr,$C42<>NAErr),$D42*PI()*($C42/200)^2,NAErr)","v":0.31572131391814429},{"$f":"IF($C42=NAErr,NAErr,SUM(IF(trUtil,(trDbh>$C42)*trBaHa,0)))","v":9.8512618387889308},{"$f":"IF($C42=NAErr,NAErr,SUM(IF(trUtil,(trDbh>$C42)*trBaHa*(trSppgrp=\"Con\"),0)))","v":1.6999440613937575},{"$f":"IF($C42=NAErr,NAErr,SUM(IF(trUtil,(trDbh>$C42)*trBaHa*(trSppgrp=\"Dec\"),0)))","v":8.1513177773951764},{"$f":"IF(ISERROR($O42),NAErr,INDEX(INDIRECT(\"SpeciesList!SppGrp\"),$O42))","v":"Con"},{"$f":"IF(ISERROR($O42),NAErr,INDEX(INDIRECT(\"SpeciesList!MGM\"),$O42))","v":"Sw"},{"$f":"IF($C42<>NAErr,PERCENTRANK(trDbh,$C42),NAErr)","v":0.67600000000000005},{"$f":"volest($O42 - 1, $C42, $E42)","v":0.84207546214524842},{"$f":"isutilized($O42, $C42)","v":true},{"$f":"ROUND(VRF($B42),3)","v":1},{"$f":"isjuveniletree($C42)","v":false},{"$f":"SUM(IF(trUtil,(trDbh>$C42)*trBaHa*(trMGMSpp=\"Sw\"),0))","v":1.6999440613937575},{"$f":"SUM(IF(trUtil,(trDbh>$C42)*trBaHa*(trMGMSpp=\"Pl\"),0))","v":0},{"$f":"SUM(IF(trUtil,(trDbh>$C42)*trDbh*trpha*(trSppgrp=\"Dec\"),0))","v":2399.0794909368547},{"$f":"SUM(IF(trUtil,(trDbh>$C42)*trDbh*trpha*(trMGMSpp=\"Sw\"),0))","v":689.2670689753802},{"$f":"SUM(IF(trUtil,(trDbh>$C42)*trDbh*trpha*(trMGMSpp=\"Pl\"),0))","v":0},{"$f":"SUM(IF(trUtil,(trDbh>$C42)*trDbh*trpha*(trMGMSpp=\"Sb\"),0))","v":0},{"$f":"IF(AND(($C42-$L42)>0,$L42>0),$AE42-MAX(0,volest($O42-1,$C42-$L42,$E42-$M42)),0)","v":3.9009902422053599E-3},-1,-1,-1,-1,-1,-1,-1,-1,-1,-1,-1,-1,-1,-1,-1,-1,-1,-1,-1,18]
[59,"SW",30.588217672744278,4.2212811568709983,28.237998827117757,195.98540178167875,189.32274115563948,0.47964745424906186,3.815292461237962,68,95,5.2192376983738673E-2,4.060582646353636E-2,0.99411909485834615,1,1,242.16441570053834,30.514116792635136,35.087779733250123,24.193533501090212,331.95984572751377,{"$f":"IF(AND(NAErr<>$L43,NAErr<>$M43),$M43/$L43,NAErr)","v":0.77800301136289929},{"$f":"IF(AND($E43<>NAErr,$C43<>NAErr),$E43/$C43,NAErr)","v":0.9231658780916584},{"$f":"IF(AND($E43<>NAErr,$C43<>NAErr),$D43*PI()*($C43/200)^2,NAErr)","v":0.31020050795706383},{"$f":"IF($C43=NAErr,NAErr,SUM(IF(trUtil,(trDbh>$C43)*trBaHa,0)))","v":10.166983152707076},{"$f":"IF($C43=NAErr,NAErr,SUM(IF(trUtil,(trDbh>$C43)*trBaHa*(trSppgrp=\"Con\"),0)))","v":2.0156653753119018},{"$f":"IF($C43=NAErr,NAErr,SUM(IF(trUtil,(trDbh>$C43)*trBaHa*(trSppgrp=\"Dec\"),0)))","v":8.1513177773951764},{"$f":"IF(ISERROR($O43),NAErr,INDEX(INDIRECT(\"SpeciesList!SppGrp\"),$O43))","v":"Con"},{"$f":"IF(ISERROR($O43),NAErr,INDEX(INDIRECT(\"SpeciesList!MGM\"),$O43))","v":"Sw"},{"$f":"IF($C43<>NAErr,PERCENTRANK(trDbh,$C43),NAErr)","v":0.66100000000000003},{"$f":"volest($O43 - 1, $C43, $E43)","v":0.8304023726405273},{"$f":"isutilized($O43, $C43)","v":true},{"$f":"ROUND(VRF($B43),3)","v":1},{"$f":"isjuveniletree($C43)","v":false},{"$f":"SUM(IF(trUtil,(trDbh>$C43)*trBaHa*(trMGMSpp=\"Sw\"),0))","v":2.0156653753119018},{"$f":"SUM(IF(trUtil,(trDbh>$C43)*trBaHa*(trMGMSpp=\"Pl\"),0))","v":0},{"$f":"SUM(IF(trUtil,(trDbh>$C43)*trDbh*trpha*(trSppgrp=\"Dec\"),0))","v":2399.0794909368547},{"$f":"SUM(IF(trUtil,(trDbh>$C43)*trDbh*trpha*(trMGMSpp=\"Sw\"),0))","v":820.15194652252171},{"$f":"SUM(IF(trUtil,(trDbh>$C43)*trDbh*trpha*(trMGMSpp=\"Pl\"),0))","v":0},{"$f":"SUM(IF(trUtil,(trDbh>$C43)*trDbh*trpha*(trMGMSpp=\"Sb\"),0))","v":0},{"$f":"IF(AND(($C43-$L43)>0,$L43>0),$AE43-MAX(0,volest($O43-1,$C43-$L43,$E43-$M43)),0)","v":3.8635460696756496E-3},-1,-1,-1,-1,-1,-1,-1,-1,-1,-1,-1,-1,-1,-1,-1,-1,-1,-1,-1,27]
[74,"SW",30.301210813204285,4.1858141986087389,28.368930174175226,196.92124621521592,190.25858558917662,0.47375184720604335,3.7883138164412027,93,52,5.1467347706436378E-2,4.0141076336263556E-2,0.99408633870221075,1,1,236.35106009528403,29.858993339647547,34.405712657441626,23.861246478474719,324.47701257084788,{"$f":"IF(AND(NAErr<>$L44,NAErr<>$M44),$M44/$L44,NAErr)","v":0.77993287249274001},{"$f":"IF(AND($E44<>NAErr,$C44<>NAErr),$E44/$C44,NAErr)","v":0.93623091001409642},{"$f":"IF(AND($E44<>NAErr,$C44<>NAErr),$D44*PI()*($C44/200)^2,NAErr)","v":0.30184903657122902},{"$f":"IF($C44=NAErr,NAErr,SUM(IF(trUtil,(trDbh>$C44)*trBaHa,0)))","v":10.477183660664139},{"$f":"IF($C44=NAErr,NAErr,SUM(IF(trUtil,(trDbh>$C44)*trBaHa*(trSppgrp=\"Con\"),0)))","v":2.3258658832689658},{"$f":"IF($C44=NAErr,NAErr,SUM(IF(trUtil,(trDbh>$C44)*trBaHa*(trSppgrp=\"Dec\"),0)))","v":8.1513177773951764},{"$f":"IF(ISERROR($O44),NAErr,INDEX(INDIRECT(\"SpeciesList!SppGrp\"),$O44))","v":"Con"},{"$f":"IF(ISERROR($O44),NAErr,INDEX(INDIRECT(\"SpeciesList!MGM\"),$O44))","v":"Sw"},{"$f":"IF($C44<>NAErr,PERCENTRANK(trDbh,$C44),NAErr)","v":0.64600000000000002},{"$f":"volest($O44 - 1, $C44, $E44)","v":0.81966833393523109},{"$f":"isutilized($O44, $C44)","v":true},{"$f":"ROUND(VRF($B44),3)","v":1},{"$f":"isjuveniletree($C44)","v":false},{"$f":"SUM(IF(trUtil,(trDbh>$C44)*trBaHa*(trMGMSpp=\"Sw\"),0))","v":2.3258658832689658},{"$f":"SUM(IF(trUtil,(trDbh>$C44)*trBaHa*(trMGMSpp=\"Pl\"),0))","v":0},{"$f":"SUM(IF(trUtil,(trDbh>$C44)*trDbh*trpha*(trSppgrp=\"Dec\"),0))","v":2399.0794909368547},{"$f":"SUM(IF(trUtil,(trDbh>$C44)*trDbh*trpha*(trMGMSpp=\"Sw\"),0))","v":949.27341340674559},{"$f":"SUM(IF(trUtil,(trDbh>$C44)*trDbh*trpha*(trMGMSpp=\"Pl\"),0))","v":0},{"$f":"SUM(IF(trUtil,(trDbh>$C44)*trDbh*trpha*(trMGMSpp=\"Sb\"),0))","v":0},{"$f":"IF(AND(($C44-$L44)>0,$L44>0),$AE44-MAX(0,volest($O44-1,$C44-$L44,$E44-$M44)),0)","v":3.7834523482064286E-3},-1,-1,-1,-1,-1,-1,-1,-1,-1,-1,-1,-1,-1,-1,-1,-1,-1,-1,-1,30]
[48,"SW",30.13122082136675,4.1313904407825159,28.008156860612146,195.89539129000664,189.23273066396737,0.47764210275212393,3.7723347572084744,29,70,5.1674591562612858E-2,4.0400766045495758E-2,0.9940584734236847,1,1,232.94857905651207,29.474761596327621,34.005014845872644,23.665128787805568,320.09348428651788,{"$f":"IF(AND(NAErr<>$L45,NAErr<>$M45),$M45/$L45,NAErr)","v":0.78183038943893968},{"$f":"IF(AND($E45<>NAErr,$C45<>NAErr),$E45/$C45,NAErr)","v":0.92953939791085105},{"$f":"IF(AND($E45<>NAErr,$C45<>NAErr),$D45*PI()*($C45/200)^2,NAErr)","v":0.29459107023896641},{"$f":"IF($C45=NAErr,NAErr,SUM(IF(trUtil,(trDbh>$C45)*trBaHa,0)))","v":10.779032697235367},{"$f":"IF($C45=NAErr,NAErr,SUM(IF(trUtil,(trDbh>$C45)*trBaHa*(trSppgrp=\"Con\"),0)))","v":2.6277149198401948},{"$f":"IF($C45=NAErr,NAErr,SUM(IF(trUtil,(trDbh>$C45)*trBaHa*(trSppgrp=\"Dec\"),0)))","v":8.1513177773951764},{"$f":"IF(ISERROR($O45),NAErr,INDEX(INDIRECT(\"SpeciesList!SppGrp\"),$O45))","v":"Con"},{"$f":"IF(ISERROR($O45),NAErr,INDEX(INDIRECT(\"SpeciesList!MGM\"),$O45))","v":"Sw"},{"$f":"IF($C45<>NAErr,PERCENTRANK(trDbh,$C45),NAErr)","v":0.63},{"$f":"volest($O45 - 1, $C45, $E45)","v":0.80060604824449477},{"$f":"isutilized($O45, $C45)","v":true},{"$f":"ROUND(VRF($B45),3)","v":1},{"$f":"isjuveniletree($C45)","v":false},{"$f":"SUM(IF(trUtil,(trDbh>$C45)*trBaHa*(trMGMSpp=\"Sw\"),0))","v":2.6277149198401948},{"$f":"SUM(IF(trUtil,(trDbh>$C45)*trBaHa*(trMGMSpp=\"Pl\"),0))","v":0},{"$f":"SUM(IF(trUtil,(trDbh>$C45)*trDbh*trpha*(trSppgrp=\"Dec\"),0))","v":2399.0794909368547},{"$f":"SUM(IF(trUtil,(trDbh>$C45)*trDbh*trpha*(trMGMSpp=\"Sw\"),0))","v":1076.1086518636928},{"$f":"SUM(IF(trUtil,(trDbh>$C45)*trDbh*trpha*(trMGMSpp=\"Pl\"),0))","v":0},{"$f":"SUM(IF(trUtil,(trDbh>$C45)*trDbh*trpha*(trMGMSpp=\"Sb\"),0))","v":0},{"$f":"IF(AND(($C45-$L45)>0,$L45>0),$AE45-MAX(0,volest($O45-1,$C45-$L45,$E45-$M45)),0)","v":3.7428078469750048E-3},-1,-1,-1,-1,-1,-1,-1,-1,-1,-1,-1,-1,-1,-1,-1,-1,-1,-1,-1,33]
[55,"SW",29.915616008354135,4.0792132825666654,27.775030525576934,195.40761568561103,188.74495505957177,0.4788182423782722,3.7520679047852887,89,30,5.1634210313219554E-2,4.0465627898468179E-2,0.99402823571230559,1,1,228.67643594040675,28.991470882781595,33.500303140089692,23.417127720549402,314.58533768382739,{"$f":"IF(AND(NAErr<>$L46,NAErr<>$M46),$M46/$L46,NAErr)","v":0.78369801054375843},{"$f":"IF(AND($E46<>NAErr,$C46<>NAErr),$E46/$C46,NAErr)","v":0.92844588317421151},{"$f":"IF(AND($E46<>NAErr,$C46<>NAErr),$D46*PI()*($C46/200)^2,NAErr)","v":0.28672277719576805},{"$f":"IF($C46=NAErr,NAErr,SUM(IF(trUtil,(trDbh>$C46)*trBaHa,0)))","v":11.073623767474334},{"$f":"IF($C46=NAErr,NAErr,SUM(IF(trUtil,(trDbh>$C46)*trBaHa*(trSppgrp=\"Con\"),0)))","v":2.922305990079161},{"$f":"IF($C46=NAErr,NAErr,SUM(IF(trUtil,(trDbh>$C46)*trBaHa*(trSppgrp=\"Dec\"),0)))","v":8.1513177773951764},{"$f":"IF(ISERROR($O46),NAErr,INDEX(INDIRECT(\"SpeciesList!SppGrp\"),$O46))","v":"Con"},{"$f":"IF(ISERROR($O46),NAErr,INDEX(INDIRECT(\"SpeciesList!MGM\"),$O46))","v":"Sw"},{"$f":"IF($C46<>NAErr,PERCENTRANK(trDbh,$C46),NAErr)","v":0.61499999999999999},{"$f":"volest($O46 - 1, $C46, $E46)","v":0.78321982067257667},{"$f":"isutilized($O46, $C46)","v":true},{"$f":"ROUND(VRF($B46),3)","v":1},{"$f":"isjuveniletree($C46)","v":false},{"$f":"SUM(IF(trUtil,(trDbh>$C46)*trBaHa*(trMGMSpp=\"Sw\"),0))","v":2.922305990079161},{"$f":"SUM(IF(trUtil,(trDbh>$C46)*trBaHa*(trMGMSpp=\"Pl\"),0))","v":0},{"$f":"SUM(IF(trUtil,(trDbh>$C46)*trDbh*trpha*(trSppgrp=\"Dec\"),0))","v":2399.0794909368547},{"$f":"SUM(IF(trUtil,(trDbh>$C46)*trDbh*trpha*(trMGMSpp=\"Sw\"),0))","v":1200.5924895341946},{"$f":"SUM(IF(trUtil,(trDbh>$C46)*trDbh*trpha*(trMGMSpp=\"Pl\"),0))","v":0},{"$f":"SUM(IF(trUtil,(trDbh>$C46)*trDbh*trpha*(trMGMSpp=\"Sb\"),0))","v":0},{"$f":"IF(AND(($C46-$L46)>0,$L46>0),$AE46-MAX(0,volest($O46-1,$C46-$L46,$E46-$M46)),0)","v":3.6896649941245974E-3},-1,-1,-1,-1,-1,-1,-1,-1,-1,-1,-1,-1,-1,-1,-1,-1,-1,-1,-1,7]
[35,"AW",29.891603294406885,3.2381977825267327,28.330754428142622,198.51175903975513,196.55511201305433,0.25828061530930213,5.1480552126623476,45,84,4.6299902967521379E-2,2.7608784951307312E-2,0.98779435534696391,3,3,271.48114308547059,57.425142888366274,42.028100763690304,6.6431787631666737,377.57756550069382,{"$f":"IF(AND(NAErr<>$L47,NAErr<>$M47),$M47/$L47,NAErr)","v":0.59630330047720448},{"$f":"IF(AND($E47<>NAErr,$C47<>NAErr),$E47/$C47,NAErr)","v":0.94778303288414378},{"$f":"IF(AND($E47<>NAErr,$C47<>NAErr),$D47*PI()*($C47/200)^2,NAErr)","v":0.22724360598612697},{"$f":"IF($C47=NAErr,NAErr,SUM(IF(trUtil,(trDbh>$C47)*trBaHa,0)))","v":11.360346544670103},{"$f":"IF($C47=NAErr,NAErr,SUM(IF(trUtil,(trDbh>$C47)*trBaHa*(trSppgrp=\"Con\"),0)))","v":3.2090287672749289},{"$f":"IF($C47=NAErr,NAErr,SUM(IF(trUtil,(trDbh>$C47)*trBaHa*(trSppgrp=\"Dec\"),0)))","v":8.1513177773951764},{"$f":"IF(ISERROR($O47),NAErr,INDEX(INDIRECT(\"SpeciesList!SppGrp\"),$O47))","v":"Dec"},{"$f":"IF(ISERROR($O47),NAErr,INDEX(INDIRECT(\"SpeciesList!MGM\"),$O47))","v":"Aw"},{"$f":"IF($C47<>NAErr,PERCENTRANK(trDbh,$C47),NAErr)","v":0.6},{"$f":"volest($O47 - 1, $C47, $E47)","v":0.81943612034203306},{"$f":"isutilized($O47, $C47)","v":true},{"$f":"ROUND(VRF($B47),3)","v":1},{"$f":"isjuveniletree($C47)","v":false},{"$f":"SUM(IF(trUtil,(trDbh>$C47)*trBaHa*(trMGMSpp=\"Sw\"),0))","v":3.2090287672749289},{"$f":"SUM(IF(trUtil,(trDbh>$C47)*trBaHa*(trMGMSpp=\"Pl\"),0))","v":0},{"$f":"SUM(IF(trUtil,(trDbh>$C47)*trDbh*trpha*(trSppgrp=\"Dec\"),0))","v":2399.0794909368547},{"$f":"SUM(IF(trUtil,(trDbh>$C47)*trDbh*trpha*(trMGMSpp=\"Sw\"),0))","v":1322.6246677116367},{"$f":"SUM(IF(trUtil,(trDbh>$C47)*trDbh*trpha*(trMGMSpp=\"Pl\"),0))","v":0},{"$f":"SUM(IF(trUtil,(trDbh>$C47)*trDbh*trpha*(trMGMSpp=\"Sb\"),0))","v":0},{"$f":"IF(AND(($C47-$L47)>0,$L47>0),$AE47-MAX(0,volest($O47-1,$C47-$L47,$E47-$M47)),0)","v":3.2219608232142427E-3},-1,-1,-1,-1,-1,-1,-1,-1,-1,-1,-1,-1,-1,-1,-1,-1,-1,-1,-1,39]
[50,"SW",29.62828453001157,4.0483203366908098,27.907730450146566,196.36171535887905,189.69905473283978,0.47277789464661302,3.7250587458210873,69,79,5.0885514280657837E-2,3.9954968726032575E-2,0.99398197890141049,1,1,223.05808507628643,28.354416136361198,32.833780790589444,23.08791831420799,307.33420031744504,{"$f":"IF(AND(NAErr<>$L48,NAErr<>$M48),$M48/$L48,NAErr)","v":0.78519337557761326},{"$f":"IF(AND($E48<>NAErr,$C48<>NAErr),$E48/$C48,NAErr)","v":0.94192866353358418},{"$f":"IF(AND($E48<>NAErr,$C48<>NAErr),$D48*PI()*($C48/200)^2,NAErr)","v":0.27911152194561051},{"$f":"IF($C48=NAErr,NAErr,SUM(IF(trUtil,(trDbh>$C48)*trBaHa,0)))","v":11.587590150656229},{"$f":"IF($C48=NAErr,NAErr,SUM(IF(trUtil,(trDbh>$C48)*trBaHa*(trSppgrp=\"Con\"),0)))","v":3.2090287672749289},{"$f":"IF($C48=NAErr,NAErr,SUM(IF(trUtil,(trDbh>$C48)*trBaHa*(trSppgrp=\"Dec\"),0)))","v":8.3785613833813031},{"$f":"IF(ISERROR($O48),NAErr,INDEX(INDIRECT(\"SpeciesList!SppGrp\"),$O48))","v":"Con"},{"$f":"IF(ISERROR($O48),NAErr,INDEX(INDIRECT(\"SpeciesList!MGM\"),$O48))","v":"Sw"},{"$f":"IF($C48<>NAErr,PERCENTRANK(trDbh,$C48),NAErr)","v":0.58399999999999996},{"$f":"volest($O48 - 1, $C48, $E48)","v":0.77287002637675695},{"$f":"isutilized($O48, $C48)","v":true},{"$f":"ROUND(VRF($B48),3)","v":1},{"$f":"isjuveniletree($C48)","v":false},{"$f":"SUM(IF(trUtil,(trDbh>$C48)*trBaHa*(trMGMSpp=\"Sw\"),0))","v":3.2090287672749289},{"$f":"SUM(IF(trUtil,(trDbh>$C48)*trBaHa*(trMGMSpp=\"Pl\"),0))","v":0},{"$f":"SUM(IF(trUtil,(trDbh>$C48)*trDbh*trpha*(trSppgrp=\"Dec\"),0))","v":2495.874414440972},{"$f":"SUM(IF(trUtil,(trDbh>$C48)*trDbh*trpha*(trMGMSpp=\"Sw\"),0))","v":1322.6246677116367},{"$f":"SUM(IF(trUtil,(trDbh>$C48)*trDbh*trpha*(trMGMSpp=\"Pl\"),0))","v":0},{"$f":"SUM(IF(trUtil,(trDbh>$C48)*trDbh*trpha*(trMGMSpp=\"Sb\"),0))","v":0},{"$f":"IF(AND(($C48-$L48)>0,$L48>0),$AE48-MAX(0,volest($O48-1,$C48-$L48,$E48-$M48)),0)","v":3.6096513206000935E-3},-1,-1,-1,-1,-1,-1,-1,-1,-1,-1,-1,-1,-1,-1,-1,-1,-1,-1,-1,20]
[69,"SW",29.577823445468088,3.9968811279993579,27.467461693232419,194.88699624026799,188.22433561422872,0.47968362803579756,3.7203154038740003,24,28,5.1317370797661931E-2,4.0386727901243091E-2,0.99396036927760811,1,1,222.08021060883556,28.2433626869541,32.717444869606886,23.030255986942681,306.07127415233924,{"$f":"IF(AND(NAErr<>$L49,NAErr<>$M49),$M49/$L49,NAErr)","v":0.7869991637039041},{"$f":"IF(AND($E49<>NAErr,$C49<>NAErr),$E49/$C49,NAErr)","v":0.92865053927559982},{"$f":"IF(AND($E49<>NAErr,$C49<>NAErr),$D49*PI()*($C49/200)^2,NAErr)","v":0.27462719295322635},{"$f":"IF($C49=NAErr,NAErr,SUM(IF(trUtil,(trDbh>$C49)*trBaHa,0)))","v":11.86670167260184},{"$f":"IF($C49=NAErr,NAErr,SUM(IF(trUtil,(trDbh>$C49)*trBaHa*(trSppgrp=\"Con\"),0)))","v":3.4881402892205395},{"$f":"IF($C49=NAErr,NAErr,SUM(IF(trUtil,(trDbh>$C49)*trBaHa*(trSppgrp=\"Dec\"),0)))","v":8.3785613833813031},{"$f":"IF(ISERROR($O49),NAErr,INDEX(INDIRECT(\"SpeciesList!SppGrp\"),$O49))","v":"Con"},{"$f":"IF(ISERROR($O49),NAErr,INDEX(INDIRECT(\"SpeciesList!MGM\"),$O49))","v":"Sw"},{"$f":"IF($C49<>NAErr,PERCENTRANK(trDbh,$C49),NAErr)","v":0.56899999999999995},{"$f":"volest($O49 - 1, $C49, $E49)","v":0.75808682187752185},{"$f":"isutilized($O49, $C49)","v":true},{"$f":"ROUND(VRF($B49),3)","v":1},{"$f":"isjuveniletree($C49)","v":false},{"$f":"SUM(IF(trUtil,(trDbh>$C49)*trBaHa*(trMGMSpp=\"Sw\"),0))","v":3.4881402892205395},{"$f":"SUM(IF(trUtil,(trDbh>$C49)*trBaHa*(trMGMSpp=\"Pl\"),0))","v":0},{"$f":"SUM(IF(trUtil,(trDbh>$C49)*trDbh*trpha*(trSppgrp=\"Dec\"),0))","v":2495.874414440972},{"$f":"SUM(IF(trUtil,(trDbh>$C49)*trDbh*trpha*(trMGMSpp=\"Sw\"),0))","v":1442.5694545157442},{"$f":"SUM(IF(trUtil,(trDbh>$C49)*trDbh*trpha*(trMGMSpp=\"Pl\"),0))","v":0},{"$f":"SUM(IF(trUtil,(trDbh>$C49)*trDbh*trpha*(trMGMSpp=\"Sb\"),0))","v":0},{"$f":"IF(AND(($C49-$L49)>0,$L49>0),$AE49-MAX(0,volest($O49-1,$C49-$L49,$E49-$M49)),0)","v":3.5952027194374736E-3},-1,-1,-1,-1,-1,-1,-1,-1,-1,-1,-1,-1,-1,-1,-1,-1,-1,-1,-1,31]
[43,"SW",29.295312989411528,3.9595194304438097,27.515803638272118,195.48908090665321,188.82642028061392,0.47507946751057062,3.6937594210046836,24,86,5.0780779138972693E-2,4.0055177051702265E-2,0.99392521620986685,1,1,216.65397446591845,27.626169528108882,32.070092113108075,22.708278231117117,299.05851433825251,{"$f":"IF(AND(NAErr<>$L50,NAErr<>$M50),$M50/$L50,NAErr)","v":0.78878618506585974},{"$f":"IF(AND($E50<>NAErr,$C50<>NAErr),$E50/$C50,NAErr)","v":0.9392561754918749},{"$f":"IF(AND($E50<>NAErr,$C50<>NAErr),$D50*PI()*($C50/200)^2,NAErr)","v":0.2668877525788021},{"$f":"IF($C50=NAErr,NAErr,SUM(IF(trUtil,(trDbh>$C50)*trBaHa,0)))","v":12.141328865555066},{"$f":"IF($C50=NAErr,NAErr,SUM(IF(trUtil,(trDbh>$C50)*trBaHa*(trSppgrp=\"Con\"),0)))","v":3.762767482173766},{"$f":"IF($C50=NAErr,NAErr,SUM(IF(trUtil,(trDbh>$C50)*trBaHa*(trSppgrp=\"Dec\"),0)))","v":8.3785613833813031},{"$f":"IF(ISERROR($O50),NAErr,INDEX(INDIRECT(\"SpeciesList!SppGrp\"),$O50))","v":"Con"},{"$f":"IF(ISERROR($O50),NAErr,INDEX(INDIRECT(\"SpeciesList!MGM\"),$O50))","v":"Sw"},{"$f":"IF($C50<>NAErr,PERCENTRANK(trDbh,$C50),NAErr)","v":0.55300000000000005},{"$f":"volest($O50 - 1, $C50, $E50)","v":0.74586384074161671},{"$f":"isutilized($O50, $C50)","v":true},{"$f":"ROUND(VRF($B50),3)","v":1},{"$f":"isjuveniletree($C50)","v":false},{"$f":"SUM(IF(trUtil,(trDbh>$C50)*trBaHa*(trMGMSpp=\"Sw\"),0))","v":3.762767482173766},{"$f":"SUM(IF(trUtil,(trDbh>$C50)*trBaHa*(trMGMSpp=\"Pl\"),0))","v":0},{"$f":"SUM(IF(trUtil,(trDbh>$C50)*trDbh*trpha*(trSppgrp=\"Dec\"),0))","v":2495.874414440972},{"$f":"SUM(IF(trUtil,(trDbh>$C50)*trDbh*trpha*(trMGMSpp=\"Sw\"),0))","v":1560.7884988522326},{"$f":"SUM(IF(trUtil,(trDbh>$C50)*trDbh*trpha*(trMGMSpp=\"Pl\"),0))","v":0},{"$f":"SUM(IF(trUtil,(trDbh>$C50)*trDbh*trpha*(trMGMSpp=\"Sb\"),0))","v":0},{"$f":"IF(AND(($C50-$L50)>0,$L50>0),$AE50-MAX(0,volest($O50-1,$C50-$L50,$E50-$M50)),0)","v":3.52473885522675E-3},-1,-1,-1,-1,-1,-1,-1,-1,-1,-1,-1,-1,-1,-1,-1,-1,-1,-1,-1,32]
[78,"SW",29.109292322854948,3.9412238856372155,27.71345823124669,196.41084028151482,189.74817965547555,0.46922832788081548,3.676273478348365,17,78,5.0108612599415715E-2,3.9613067891446724E-2,0.99389546361811998,1,1,213.12579669527022,27.223981935438431,31.647509211172355,22.497059590190098,294.49434743207109,{"$f":"IF(AND(NAErr<>$L51,NAErr<>$M51),$M51/$L51,NAErr)","v":0.79054409684271776},{"$f":"IF(AND($E51<>NAErr,$C51<>NAErr),$E51/$C51,NAErr)","v":0.95204850478236025},{"$f":"IF(AND($E51<>NAErr,$C51<>NAErr),$D51*PI()*($C51/200)^2,NAErr)","v":0.26229153960716117},{"$f":"IF($C51=NAErr,NAErr,SUM(IF(trUtil,(trDbh>$C51)*trBaHa,0)))","v":12.408216618133867},{"$f":"IF($C51=NAErr,NAErr,SUM(IF(trUtil,(trDbh>$C51)*trBaHa*(trSppgrp=\"Con\"),0)))","v":4.0296552347525685},{"$f":"IF($C51=NAErr,NAErr,SUM(IF(trUtil,(trDbh>$C51)*trBaHa*(trSppgrp=\"Dec\"),0)))","v":8.3785613833813031},{"$f":"IF(ISERROR($O51),NAErr,INDEX(INDIRECT(\"SpeciesList!SppGrp\"),$O51))","v":"Con"},{"$f":"IF(ISERROR($O51),NAErr,INDEX(INDIRECT(\"SpeciesList!MGM\"),$O51))","v":"Sw"},{"$f":"IF($C51<>NAErr,PERCENTRANK(trDbh,$C51),NAErr)","v":0.53800000000000003},{"$f":"volest($O51 - 1, $C51, $E51)","v":0.74234827250510382},{"$f":"isutilized($O51, $C51)","v":true},{"$f":"ROUND(VRF($B51),3)","v":1},{"$f":"isjuveniletree($C51)","v":false},{"$f":"SUM(IF(trUtil,(trDbh>$C51)*trBaHa*(trMGMSpp=\"Sw\"),0))","v":4.0296552347525685},{"$f":"SUM(IF(trUtil,(trDbh>$C51)*trBaHa*(trMGMSpp=\"Pl\"),0))","v":0},{"$f":"SUM(IF(trUtil,(trDbh>$C51)*trDbh*trpha*(trSppgrp=\"Dec\"),0))","v":2495.874414440972},{"$f":"SUM(IF(trUtil,(trDbh>$C51)*trDbh*trpha*(trMGMSpp=\"Sw\"),0))","v":1676.7838598547405},{"$f":"SUM(IF(trUtil,(trDbh>$C51)*trDbh*trpha*(trMGMSpp=\"Pl\"),0))","v":0},{"$f":"SUM(IF(trUtil,(trDbh>$C51)*trDbh*trpha*(trMGMSpp=\"Sb\"),0))","v":0},{"$f":"IF(AND(($C51-$L51)>0,$L51>0),$AE51-MAX(0,volest($O51-1,$C51-$L51,$E51-$M51)),0)","v":3.4721666609380808E-3},-1,-1,-1,-1,-1,-1,-1,-1,-1,-1,-1,-1,-1,-1,-1,-1,-1,-1,-1,13]
[19,"AW",29.083487900504743,2.7382564025670888,25.320457456487887,195.71913403350166,193.76248700680082,0.28516136062577735,5.0576716790841836,87,88,4.3712275648233108E-2,2.8040237605973583E-2,0.98764633486947018,3,3,253.67661560816128,53.776961272040943,39.221865350266185,6.3528667037510713,353.02830893421947,{"$f":"IF(AND(NAErr<>$L52,NAErr<>$M52),$M52/$L52,NAErr)","v":0.64147284006951477},{"$f":"IF(AND($E52<>NAErr,$C52<>NAErr),$E52/$C52,NAErr)","v":0.87061282137512985},{"$f":"IF(AND($E52<>NAErr,$C52<>NAErr),$D52*PI()*($C52/200)^2,NAErr)","v":0.18191016643657415},{"$f":"IF($C52=NAErr,NAErr,SUM(IF(trUtil,(trDbh>$C52)*trBaHa,0)))","v":12.670508157741029},{"$f":"IF($C52=NAErr,NAErr,SUM(IF(trUtil,(trDbh>$C52)*trBaHa*(trSppgrp=\"Con\"),0)))","v":4.2919467743597295},{"$f":"IF($C52=NAErr,NAErr,SUM(IF(trUtil,(trDbh>$C52)*trBaHa*(trSppgrp=\"Dec\"),0)))","v":8.3785613833813031},{"$f":"IF(ISERROR($O52),NAErr,INDEX(INDIRECT(\"SpeciesList!SppGrp\"),$O52))","v":"Dec"},{"$f":"IF(ISERROR($O52),NAErr,INDEX(INDIRECT(\"SpeciesList!MGM\"),$O52))","v":"Aw"},{"$f":"IF($C52<>NAErr,PERCENTRANK(trDbh,$C52),NAErr)","v":0.52300000000000002},{"$f":"volest($O52 - 1, $C52, $E52)","v":0.69409019927734661},{"$f":"isutilized($O52, $C52)","v":true},{"$f":"ROUND(VRF($B52),3)","v":1},{"$f":"isjuveniletree($C52)","v":false},{"$f":"SUM(IF(trUtil,(trDbh>$C52)*trBaHa*(trMGMSpp=\"Sw\"),0))","v":4.2919467743597295},{"$f":"SUM(IF(trUtil,(trDbh>$C52)*trBaHa*(trMGMSpp=\"Pl\"),0))","v":0},{"$f":"SUM(IF(trUtil,(trDbh>$C52)*trDbh*trpha*(trSppgrp=\"Dec\"),0))","v":2495.874414440972},{"$f":"SUM(IF(trUtil,(trDbh>$C52)*trDbh*trpha*(trMGMSpp=\"Sw\"),0))","v":1791.5100980515724},{"$f":"SUM(IF(trUtil,(trDbh>$C52)*trDbh*trpha*(trMGMSpp=\"Pl\"),0))","v":0},{"$f":"SUM(IF(trUtil,(trDbh>$C52)*trDbh*trpha*(trMGMSpp=\"Sb\"),0))","v":0},{"$f":"IF(AND(($C52-$L52)>0,$L52>0),$AE52-MAX(0,volest($O52-1,$C52-$L52,$E52-$M52)),0)","v":2.7635511942309954E-3},-1,-1,-1,-1,-1,-1,-1,-1,-1,-1,-1,-1,-1,-1,-1,-1,-1,-1,-1,36]
[2,"AW",29.057922921341319,2.9001626772574225,26.719126840920428,197.37799830377736,195.42135127707652,0.27011705880005232,5.0547740047477046,44,18,4.2982164057355512E-2,2.763598572011329E-2,0.98761388848132059,3,3,253.12508071074683,53.663821241561656,39.134993615490195,6.3437645848313133,352.26766015263001,{"$f":"IF(AND(NAErr<>$L53,NAErr<>$M53),$M53/$L53,NAErr)","v":0.64296403697207427},{"$f":"IF(AND($E53<>NAErr,$C53<>NAErr),$E53/$C53,NAErr)","v":0.91951262012939039},{"$f":"IF(AND($E53<>NAErr,$C53<>NAErr),$D53*PI()*($C53/200)^2,NAErr)","v":0.19232749515373035},{"$f":"IF($C53=NAErr,NAErr,SUM(IF(trUtil,(trDbh>$C53)*trBaHa,0)))","v":12.852418324177604},{"$f":"IF($C53=NAErr,NAErr,SUM(IF(trUtil,(trDbh>$C53)*trBaHa*(trSppgrp=\"Con\"),0)))","v":4.2919467743597295},{"$f":"IF($C53=NAErr,NAErr,SUM(IF(trUtil,(trDbh>$C53)*trBaHa*(trSppgrp=\"Dec\"),0)))","v":8.5604715498178781},{"$f":"IF(ISERROR($O53),NAErr,INDEX(INDIRECT(\"SpeciesList!SppGrp\"),$O53))","v":"Dec"},{"$f":"IF(ISERROR($O53),NAErr,INDEX(INDIRECT(\"SpeciesList!MGM\"),$O53))","v":"Aw"},{"$f":"IF($C53<>NAErr,PERCENTRANK(trDbh,$C53),NAErr)","v":0.50700000000000001},{"$f":"volest($O53 - 1, $C53, $E53)","v":0.73172399268764421},{"$f":"isutilized($O53, $C53)","v":true},{"$f":"ROUND(VRF($B53),3)","v":1},{"$f":"isjuveniletree($C53)","v":false},{"$f":"SUM(IF(trUtil,(trDbh>$C53)*trBaHa*(trMGMSpp=\"Sw\"),0))","v":4.2919467743597295},{"$f":"SUM(IF(trUtil,(trDbh>$C53)*trBaHa*(trMGMSpp=\"Pl\"),0))","v":0},{"$f":"SUM(IF(trUtil,(trDbh>$C53)*trDbh*trpha*(trSppgrp=\"Dec\"),0))","v":2575.5124613935118},{"$f":"SUM(IF(trUtil,(trDbh>$C53)*trDbh*trpha*(trMGMSpp=\"Sw\"),0))","v":1791.5100980515724},{"$f":"SUM(IF(trUtil,(trDbh>$C53)*trDbh*trpha*(trMGMSpp=\"Pl\"),0))","v":0},{"$f":"SUM(IF(trUtil,(trDbh>$C53)*trDbh*trpha*(trMGMSpp=\"Sb\"),0))","v":0},{"$f":"IF(AND(($C53-$L53)>0,$L53>0),$AE53-MAX(0,volest($O53-1,$C53-$L53,$E53-$M53)),0)","v":2.8265000388887351E-3},-1,-1,-1,-1,-1,-1,-1,-1,-1,-1,-1,-1,-1,-1,-1,-1,-1,-1,-1,5]
[56,"SW",28.969104202219889,3.9087840981859578,27.540740943741991,196.08589287834775,189.42323225230848,0.47030135336203988,3.6630957950086693,86,9,4.9953305428389043E-2,3.9548063834312266E-2,0.99384859544576465,1,1,210.49029705480223,26.923089691622426,31.330968741764185,22.338297659087235,291.08265314727606,{"$f":"IF(AND(NAErr<>$L54,NAErr<>$M54),$M54/$L54,NAErr)","v":0.79170063913001132},{"$f":"IF(AND($E54<>NAErr,$C54<>NAErr),$E54/$C54,NAErr)","v":0.95069356482315936},{"$f":"IF(AND($E54<>NAErr,$C54<>NAErr),$D54*PI()*($C54/200)^2,NAErr)","v":0.25763312183412584},{"$f":"IF($C54=NAErr,NAErr,SUM(IF(trUtil,(trDbh>$C54)*trBaHa,0)))","v":13.044745819331334},{"$f":"IF($C54=NAErr,NAErr,SUM(IF(trUtil,(trDbh>$C54)*trBaHa*(trSppgrp=\"Con\"),0)))","v":4.2919467743597295},{"$f":"IF($C54=NAErr,NAErr,SUM(IF(trUtil,(trDbh>$C54)*trBaHa*(trSppgrp=\"Dec\"),0)))","v":8.7527990449716082},{"$f":"IF(ISERROR($O54),NAErr,INDEX(INDIRECT(\"SpeciesList!SppGrp\"),$O54))","v":"Con"},{"$f":"IF(ISERROR($O54),NAErr,INDEX(INDIRECT(\"SpeciesList!MGM\"),$O54))","v":"Sw"},{"$f":"IF($C54<>NAErr,PERCENTRANK(trDbh,$C54),NAErr)","v":0.49199999999999999},{"$f":"volest($O54 - 1, $C54, $E54)","v":0.73099656436820992},{"$f":"isutilized($O54, $C54)","v":true},{"$f":"ROUND(VRF($B54),3)","v":1},{"$f":"isjuveniletree($C54)","v":false},{"$f":"SUM(IF(trUtil,(trDbh>$C54)*trBaHa*(trMGMSpp=\"Sw\"),0))","v":4.2919467743597295},{"$f":"SUM(IF(trUtil,(trDbh>$C54)*trBaHa*(trMGMSpp=\"Pl\"),0))","v":0},{"$f":"SUM(IF(trUtil,(trDbh>$C54)*trDbh*trpha*(trSppgrp=\"Dec\"),0))","v":2659.785164928609},{"$f":"SUM(IF(trUtil,(trDbh>$C54)*trDbh*trpha*(trMGMSpp=\"Sw\"),0))","v":1791.5100980515724},{"$f":"SUM(IF(trUtil,(trDbh>$C54)*trDbh*trpha*(trMGMSpp=\"Pl\"),0))","v":0},{"$f":"SUM(IF(trUtil,(trDbh>$C54)*trDbh*trpha*(trMGMSpp=\"Sb\"),0))","v":0},{"$f":"IF(AND(($C54-$L54)>0,$L54>0),$AE54-MAX(0,volest($O54-1,$C54-$L54,$E54-$M54)),0)","v":3.4283565877094579E-3},-1,-1,-1,-1,-1,-1,-1,-1,-1,-1,-1,-1,-1,-1,-1,-1,-1,-1,-1,10]
[67,"SW",28.815415956070467,3.8584874179043345,27.237979413138461,195.26743997020583,188.60477934416656,0.47345446375206157,3.648649099870624,45,65,5.0089356413481535E-2,3.9741922898012608E-2,0.99382045255026186,1,1,207.62402714539675,26.595393356418022,30.985845450720653,22.164658793177342,287.36992474571275,{"$f":"IF(AND(NAErr<>$L55,NAErr<>$M55),$M55/$L55,NAErr)","v":0.79342051373045952},{"$f":"IF(AND($E55<>NAErr,$C55<>NAErr),$E55/$C55,NAErr)","v":0.94525720033551375},{"$f":"IF(AND($E55<>NAErr,$C55<>NAErr),$D55*PI()*($C55/200)^2,NAErr)","v":0.25162671965603817},{"$f":"IF($C55=NAErr,NAErr,SUM(IF(trUtil,(trDbh>$C55)*trBaHa,0)))","v":13.302378941165459},{"$f":"IF($C55=NAErr,NAErr,SUM(IF(trUtil,(trDbh>$C55)*trBaHa*(trSppgrp=\"Con\"),0)))","v":4.5495798961938556},{"$f":"IF($C55=NAErr,NAErr,SUM(IF(trUtil,(trDbh>$C55)*trBaHa*(trSppgrp=\"Dec\"),0)))","v":8.7527990449716082},{"$f":"IF(ISERROR($O55),NAErr,INDEX(INDIRECT(\"SpeciesList!SppGrp\"),$O55))","v":"Con"},{"$f":"IF(ISERROR($O55),NAErr,INDEX(INDIRECT(\"SpeciesList!MGM\"),$O55))","v":"Sw"},{"$f":"IF($C55<>NAErr,PERCENTRANK(trDbh,$C55),NAErr)","v":0.47599999999999998},{"$f":"volest($O55 - 1, $C55, $E55)","v":0.71566208940113696},{"$f":"isutilized($O55, $C55)","v":true},{"$f":"ROUND(VRF($B55),3)","v":1},{"$f":"isjuveniletree($C55)","v":false},{"$f":"SUM(IF(trUtil,(trDbh>$C55)*trBaHa*(trMGMSpp=\"Sw\"),0))","v":4.5495798961938556},{"$f":"SUM(IF(trUtil,(trDbh>$C55)*trBaHa*(trMGMSpp=\"Pl\"),0))","v":0},{"$f":"SUM(IF(trUtil,(trDbh>$C55)*trDbh*trpha*(trSppgrp=\"Dec\"),0))","v":2659.785164928609},{"$f":"SUM(IF(trUtil,(trDbh>$C55)*trDbh*trpha*(trMGMSpp=\"Sw\"),0))","v":1904.7440718959015},{"$f":"SUM(IF(trUtil,(trDbh>$C55)*trDbh*trpha*(trMGMSpp=\"Pl\"),0))","v":0},{"$f":"SUM(IF(trUtil,(trDbh>$C55)*trDbh*trpha*(trMGMSpp=\"Sb\"),0))","v":0},{"$f":"IF(AND(($C55-$L55)>0,$L55>0),$AE55-MAX(0,volest($O55-1,$C55-$L55,$E55-$M55)),0)","v":3.3921509271079842E-3},-1,-1,-1,-1,-1,-1,-1,-1,-1,-1,-1,-1,-1,-1,-1,-1,-1,-1,-1,4]
[65,"SW",28.615532794145476,3.7888523477734832,26.650667694386513,193.74797902701664,187.08531840097734,0.48112750935808629,3.6298600826496745,71,79,5.0557058876492034E-2,4.0198512724820203E-2,0.99378892221560344,1,1,203.93214257075405,26.172592124926471,30.53995829194125,21.939474752329165,282.58416773995094,{"$f":"IF(AND(NAErr<>$L56,NAErr<>$M56),$M56/$L56,NAErr)","v":0.7951117730764925},{"$f":"IF(AND($E56<>NAErr,$C56<>NAErr),$E56/$C56,NAErr)","v":0.93133571498060796},{"$f":"IF(AND($E56<>NAErr,$C56<>NAErr),$D56*PI()*($C56/200)^2,NAErr)","v":0.24366953548193049},{"$f":"IF($C56=NAErr,NAErr,SUM(IF(trUtil,(trDbh>$C56)*trBaHa,0)))","v":13.554005660821497},{"$f":"IF($C56=NAErr,NAErr,SUM(IF(trUtil,(trDbh>$C56)*trBaHa*(trSppgrp=\"Con\"),0)))","v":4.8012066158498934},{"$f":"IF($C56=NAErr,NAErr,SUM(IF(trUtil,(trDbh>$C56)*trBaHa*(trSppgrp=\"Dec\"),0)))","v":8.7527990449716082},{"$f":"IF(ISERROR($O56),NAErr,INDEX(INDIRECT(\"SpeciesList!SppGrp\"),$O56))","v":"Con"},{"$f":"IF(ISERROR($O56),NAErr,INDEX(INDIRECT(\"SpeciesList!MGM\"),$O56))","v":"Sw"},{"$f":"IF($C56<>NAErr,PERCENTRANK(trDbh,$C56),NAErr)","v":0.46100000000000002},{"$f":"volest($O56 - 1, $C56, $E56)","v":0.69092638768574499},{"$f":"isutilized($O56, $C56)","v":true},{"$f":"ROUND(VRF($B56),3)","v":1},{"$f":"isjuveniletree($C56)","v":false},{"$f":"SUM(IF(trUtil,(trDbh>$C56)*trBaHa*(trMGMSpp=\"Sw\"),0))","v":4.8012066158498934},{"$f":"SUM(IF(trUtil,(trDbh>$C56)*trBaHa*(trMGMSpp=\"Pl\"),0))","v":0},{"$f":"SUM(IF(trUtil,(trDbh>$C56)*trDbh*trpha*(trSppgrp=\"Dec\"),0))","v":2659.785164928609},{"$f":"SUM(IF(trUtil,(trDbh>$C56)*trDbh*trpha*(trMGMSpp=\"Sw\"),0))","v":2015.9279918040793},{"$f":"SUM(IF(trUtil,(trDbh>$C56)*trDbh*trpha*(trMGMSpp=\"Pl\"),0))","v":0},{"$f":"SUM(IF(trUtil,(trDbh>$C56)*trDbh*trpha*(trMGMSpp=\"Sb\"),0))","v":0},{"$f":"IF(AND(($C56-$L56)>0,$L56>0),$AE56-MAX(0,volest($O56-1,$C56-$L56,$E56-$M56)),0)","v":3.3466410486591158E-3},-1,-1,-1,-1,-1,-1,-1,-1,-1,-1,-1,-1,-1,-1,-1,-1,-1,-1,-1,11]
[68,"SW",28.330816008017326,3.7736584330004432,27.147065829236531,195.66611426799182,189.00345364195255,0.46846331432957933,3.6030967047536286,99,16,4.9446483028037183E-2,3.9397463401697023E-2,0.993750712979099,1,1,198.7431809649195,25.57695571518682,29.910627574044646,21.619985959847998,275.85075021399894,{"$f":"IF(AND(NAErr<>$L57,NAErr<>$M57),$M57/$L57,NAErr)","v":0.79676977995296128},{"$f":"IF(AND($E57<>NAErr,$C57<>NAErr),$E57/$C57,NAErr)","v":0.95821686962896491},{"$f":"IF(AND($E57<>NAErr,$C57<>NAErr),$D57*PI()*($C57/200)^2,NAErr)","v":0.23788696014871208},{"$f":"IF($C57=NAErr,NAErr,SUM(IF(trUtil,(trDbh>$C57)*trBaHa,0)))","v":13.797675196303427},{"$f":"IF($C57=NAErr,NAErr,SUM(IF(trUtil,(trDbh>$C57)*trBaHa*(trSppgrp=\"Con\"),0)))","v":5.0448761513318239},{"$f":"IF($C57=NAErr,NAErr,SUM(IF(trUtil,(trDbh>$C57)*trBaHa*(trSppgrp=\"Dec\"),0)))","v":8.7527990449716082},{"$f":"IF(ISERROR($O57),NAErr,INDEX(INDIRECT(\"SpeciesList!SppGrp\"),$O57))","v":"Con"},{"$f":"IF(ISERROR($O57),NAErr,INDEX(INDIRECT(\"SpeciesList!MGM\"),$O57))","v":"Sw"},{"$f":"IF($C57<>NAErr,PERCENTRANK(trDbh,$C57),NAErr)","v":0.44600000000000001},{"$f":"volest($O57 - 1, $C57, $E57)","v":0.69084501622339523},{"$f":"isutilized($O57, $C57)","v":true},{"$f":"ROUND(VRF($B57),3)","v":1},{"$f":"isjuveniletree($C57)","v":false},{"$f":"SUM(IF(trUtil,(trDbh>$C57)*trBaHa*(trMGMSpp=\"Sw\"),0))","v":5.0448761513318239},{"$f":"SUM(IF(trUtil,(trDbh>$C57)*trBaHa*(trMGMSpp=\"Pl\"),0))","v":0},{"$f":"SUM(IF(trUtil,(trDbh>$C57)*trDbh*trpha*(trSppgrp=\"Dec\"),0))","v":2659.785164928609},{"$f":"SUM(IF(trUtil,(trDbh>$C57)*trDbh*trpha*(trMGMSpp=\"Sw\"),0))","v":2124.3480204139664},{"$f":"SUM(IF(trUtil,(trDbh>$C57)*trDbh*trpha*(trMGMSpp=\"Pl\"),0))","v":0},{"$f":"SUM(IF(trUtil,(trDbh>$C57)*trDbh*trpha*(trMGMSpp=\"Sb\"),0))","v":0},{"$f":"IF(AND(($C57-$L57)>0,$L57>0),$AE57-MAX(0,volest($O57-1,$C57-$L57,$E57-$M57)),0)","v":3.2793730925582132E-3},-1,-1,-1,-1,-1,-1,-1,-1,-1,-1,-1,-1,-1,-1,-1,-1,-1,-1,-1,24]
[75,"SW",28.172203021241465,3.7374300305833241,26.958262191715825,195.2722461647777,188.60958553873843,0.46957199995215121,3.5881870839966976,72,6,4.9402031030452057E-2,3.9442809940220605E-2,0.99372164616564618,1,1,195.88788849243562,25.248492716726616,29.56298663465779,21.442650126087361,272.14201796990739,{"$f":"IF(AND(NAErr<>$L58,NAErr<>$M58),$M58/$L58,NAErr)","v":0.79840462259350309},{"$f":"IF(AND($E58<>NAErr,$C58<>NAErr),$E58/$C58,NAErr)","v":0.95690997865483418},{"$f":"IF(AND($E58<>NAErr,$C58<>NAErr),$D58*PI()*($C58/200)^2,NAErr)","v":0.23297245228923846},{"$f":"IF($C58=NAErr,NAErr,SUM(IF(trUtil,(trDbh>$C58)*trBaHa,0)))","v":14.035562156452139},{"$f":"IF($C58=NAErr,NAErr,SUM(IF(trUtil,(trDbh>$C58)*trBaHa*(trSppgrp=\"Con\"),0)))","v":5.282763111480536},{"$f":"IF($C58=NAErr,NAErr,SUM(IF(trUtil,(trDbh>$C58)*trBaHa*(trSppgrp=\"Dec\"),0)))","v":8.7527990449716082},{"$f":"IF(ISERROR($O58),NAErr,INDEX(INDIRECT(\"SpeciesList!SppGrp\"),$O58))","v":"Con"},{"$f":"IF(ISERROR($O58),NAErr,INDEX(INDIRECT(\"SpeciesList!MGM\"),$O58))","v":"Sw"},{"$f":"IF($C58<>NAErr,PERCENTRANK(trDbh,$C58),NAErr)","v":0.43},{"$f":"volest($O58 - 1, $C58, $E58)","v":0.67876910413564695},{"$f":"isutilized($O58, $C58)","v":true},{"$f":"ROUND(VRF($B58),3)","v":1},{"$f":"isjuveniletree($C58)","v":false},{"$f":"SUM(IF(trUtil,(trDbh>$C58)*trBaHa*(trMGMSpp=\"Sw\"),0))","v":5.282763111480536},{"$f":"SUM(IF(trUtil,(trDbh>$C58)*trBaHa*(trMGMSpp=\"Pl\"),0))","v":0},{"$f":"SUM(IF(trUtil,(trDbh>$C58)*trDbh*trpha*(trSppgrp=\"Dec\"),0))","v":2659.785164928609},{"$f":"SUM(IF(trUtil,(trDbh>$C58)*trDbh*trpha*(trMGMSpp=\"Sw\"),0))","v":2231.258843156405},{"$f":"SUM(IF(trUtil,(trDbh>$C58)*trDbh*trpha*(trMGMSpp=\"Pl\"),0))","v":0},{"$f":"SUM(IF(trUtil,(trDbh>$C58)*trDbh*trpha*(trMGMSpp=\"Sb\"),0))","v":0},{"$f":"IF(AND(($C58-$L58)>0,$L58>0),$AE58-MAX(0,volest($O58-1,$C58-$L58,$E58-$M58)),0)","v":3.2410377790303979E-3},-1,-1,-1,-1,-1,-1,-1,-1,-1,-1,-1,-1,-1,-1,-1,-1,-1,-1,-1,23]
[63,"SW",28.043371595028741,3.7051849250237683,26.854567140897309,195.11877093936403,188.45611031332476,0.46961235652618066,3.5760769299327015,7,99,4.9252411845726755E-2,3.9402834763501045E-2,0.99369486305819077,1,1,193.5872979114996,24.98346879402332,29.282173979628876,21.29895394865159,269.15189463380341,{"$f":"IF(AND(NAErr<>$L59,NAErr<>$M59),$M59/$L59,NAErr)","v":0.80001838056017394},{"$f":"IF(AND($E59<>NAErr,$C59<>NAErr),$E59/$C59,NAErr)","v":0.95760836210071931},{"$f":"IF(AND($E59<>NAErr,$C59<>NAErr),$D59*PI()*($C59/200)^2,NAErr)","v":0.22885490407185674},{"$f":"IF($C59=NAErr,NAErr,SUM(IF(trUtil,(trDbh>$C59)*trBaHa,0)))","v":14.268534608741378},{"$f":"IF($C59=NAErr,NAErr,SUM(IF(trUtil,(trDbh>$C59)*trBaHa*(trSppgrp=\"Con\"),0)))","v":5.5157355637697743},{"$f":"IF($C59=NAErr,NAErr,SUM(IF(trUtil,(trDbh>$C59)*trBaHa*(trSppgrp=\"Dec\"),0)))","v":8.7527990449716082},{"$f":"IF(ISERROR($O59),NAErr,INDEX(INDIRECT(\"SpeciesList!SppGrp\"),$O59))","v":"Con"},{"$f":"IF(ISERROR($O59),NAErr,INDEX(INDIRECT(\"SpeciesList!MGM\"),$O59))","v":"Sw"},{"$f":"IF($C59<>NAErr,PERCENTRANK(trDbh,$C59),NAErr)","v":0.41499999999999998},{"$f":"volest($O59 - 1, $C59, $E59)","v":0.67031689641570602},{"$f":"isutilized($O59, $C59)","v":true},{"$f":"ROUND(VRF($B59),3)","v":1},{"$f":"isjuveniletree($C59)","v":false},{"$f":"SUM(IF(trUtil,(trDbh>$C59)*trBaHa*(trMGMSpp=\"Sw\"),0))","v":5.5157355637697743},{"$f":"SUM(IF(trUtil,(trDbh>$C59)*trBaHa*(trMGMSpp=\"Pl\"),0))","v":0},{"$f":"SUM(IF(trUtil,(trDbh>$C59)*trDbh*trpha*(trSppgrp=\"Dec\"),0))","v":2659.785164928609},{"$f":"SUM(IF(trUtil,(trDbh>$C59)*trDbh*trpha*(trMGMSpp=\"Sw\"),0))","v":2336.5504807556831},{"$f":"SUM(IF(trUtil,(trDbh>$C59)*trDbh*trpha*(trMGMSpp=\"Pl\"),0))","v":0},{"$f":"SUM(IF(trUtil,(trDbh>$C59)*trDbh*trpha*(trMGMSpp=\"Sb\"),0))","v":0},{"$f":"IF(AND(($C59-$L59)>0,$L59>0),$AE59-MAX(0,volest($O59-1,$C59-$L59,$E59-$M59)),0)","v":3.207215402356689E-3},-1,-1,-1,-1,-1,-1,-1,-1,-1,-1,-1,-1,-1,-1,-1,-1,-1,-1,-1,73]
[52,"SW",27.883682122550596,3.6698243555230965,26.697418130187035,194.88439307955639,188.22173245351712,0.4701641691301981,3.5610661195197562,85,98,4.9142667895290003E-2,3.9393450858377026E-2,0.9936653960129378,1,1,190.75871612843125,24.657159391225516,28.936033384667901,21.121266797843212,265.47317570216785,{"$f":"IF(AND(NAErr<>$L60,NAErr<>$M60),$M60/$L60,NAErr)","v":0.80161400561959772},{"$f":"IF(AND($E60<>NAErr,$C60<>NAErr),$E60/$C60,NAErr)","v":0.95745669502507402},{"$f":"IF(AND($E60<>NAErr,$C60<>NAErr),$D60*PI()*($C60/200)^2,NAErr)","v":0.22409667156790691},{"$f":"IF($C60=NAErr,NAErr,SUM(IF(trUtil,(trDbh>$C60)*trBaHa,0)))","v":14.497389512813236},{"$f":"IF($C60=NAErr,NAErr,SUM(IF(trUtil,(trDbh>$C60)*trBaHa*(trSppgrp=\"Con\"),0)))","v":5.7445904678416309},{"$f":"IF($C60=NAErr,NAErr,SUM(IF(trUtil,(trDbh>$C60)*trBaHa*(trSppgrp=\"Dec\"),0)))","v":8.7527990449716082},{"$f":"IF(ISERROR($O60),NAErr,INDEX(INDIRECT(\"SpeciesList!SppGrp\"),$O60))","v":"Con"},{"$f":"IF(ISERROR($O60),NAErr,INDEX(INDIRECT(\"SpeciesList!MGM\"),$O60))","v":"Sw"},{"$f":"IF($C60<>NAErr,PERCENTRANK(trDbh,$C60),NAErr)","v":0.4},{"$f":"volest($O60 - 1, $C60, $E60)","v":0.65921910821421692},{"$f":"isutilized($O60, $C60)","v":true},{"$f":"ROUND(VRF($B60),3)","v":1},{"$f":"isjuveniletree($C60)","v":false},{"$f":"SUM(IF(trUtil,(trDbh>$C60)*trBaHa*(trMGMSpp=\"Sw\"),0))","v":5.7445904678416309},{"$f":"SUM(IF(trUtil,(trDbh>$C60)*trBaHa*(trMGMSpp=\"Pl\"),0))","v":0},{"$f":"SUM(IF(trUtil,(trDbh>$C60)*trDbh*trpha*(trSppgrp=\"Dec\"),0))","v":2659.785164928609},{"$f":"SUM(IF(trUtil,(trDbh>$C60)*trDbh*trpha*(trMGMSpp=\"Sw\"),0))","v":2440.4563584364232},{"$f":"SUM(IF(trUtil,(trDbh>$C60)*trDbh*trpha*(trMGMSpp=\"Pl\"),0))","v":0},{"$f":"SUM(IF(trUtil,(trDbh>$C60)*trDbh*trpha*(trMGMSpp=\"Sb\"),0))","v":0},{"$f":"IF(AND(($C60-$L60)>0,$L60>0),$AE60-MAX(0,volest($O60-1,$C60-$L60,$E60-$M60)),0)","v":3.1675671703577102E-3},-1,-1,-1,-1,-1,-1,-1,-1,-1,-1,-1,-1,-1,-1,-1,-1,-1,-1,-1,62]
[51,"SW",27.668547077055322,3.6199504502405389,26.476460465557249,194.4833332606529,187.82067263461363,0.47107871129799062,3.5408434252432004,35,63,4.9111790464976698E-2,3.9446014575085515E-2,0.99363085709988719,1,1,186.98823251153254,24.221385055106474,28.473091310156843,20.882635761908368,260.56534463870423,{"$f":"IF(AND(NAErr<>$L61,NAErr<>$M61),$M61/$L61,NAErr)","v":0.80318828129908681},{"$f":"IF(AND($E61<>NAErr,$C61<>NAErr),$E61/$C61,NAErr)","v":0.95691546042594211},{"$f":"IF(AND($E61<>NAErr,$C61<>NAErr),$D61*PI()*($C61/200)^2,NAErr)","v":0.21765327971009946},{"$f":"IF($C61=NAErr,NAErr,SUM(IF(trUtil,(trDbh>$C61)*trBaHa,0)))","v":14.721486184381142},{"$f":"IF($C61=NAErr,NAErr,SUM(IF(trUtil,(trDbh>$C61)*trBaHa*(trSppgrp=\"Con\"),0)))","v":5.9686871394095373},{"$f":"IF($C61=NAErr,NAErr,SUM(IF(trUtil,(trDbh>$C61)*trBaHa*(trSppgrp=\"Dec\"),0)))","v":8.7527990449716082},{"$f":"IF(ISERROR($O61),NAErr,INDEX(INDIRECT(\"SpeciesList!SppGrp\"),$O61))","v":"Con"},{"$f":"IF(ISERROR($O61),NAErr,INDEX(INDIRECT(\"SpeciesList!MGM\"),$O61))","v":"Sw"},{"$f":"IF($C61<>NAErr,PERCENTRANK(trDbh,$C61),NAErr)","v":0.38400000000000001},{"$f":"volest($O61 - 1, $C61, $E61)","v":0.6442295160815914},{"$f":"isutilized($O61, $C61)","v":true},{"$f":"ROUND(VRF($B61),3)","v":1},{"$f":"isjuveniletree($C61)","v":false},{"$f":"SUM(IF(trUtil,(trDbh>$C61)*trBaHa*(trMGMSpp=\"Sw\"),0))","v":5.9686871394095373},{"$f":"SUM(IF(trUtil,(trDbh>$C61)*trBaHa*(trMGMSpp=\"Pl\"),0))","v":0},{"$f":"SUM(IF(trUtil,(trDbh>$C61)*trDbh*trpha*(trSppgrp=\"Dec\"),0))","v":2659.785164928609},{"$f":"SUM(IF(trUtil,(trDbh>$C61)*trDbh*trpha*(trMGMSpp=\"Sw\"),0))","v":2542.7845742114232},{"$f":"SUM(IF(trUtil,(trDbh>$C61)*trDbh*trpha*(trMGMSpp=\"Pl\"),0))","v":0},{"$f":"SUM(IF(trUtil,(trDbh>$C61)*trDbh*trpha*(trMGMSpp=\"Sb\"),0))","v":0},{"$f":"IF(AND(($C61-$L61)>0,$L61>0),$AE61-MAX(0,volest($O61-1,$C61-$L61,$E61-$M61)),0)","v":3.120541826237333E-3},-1,-1,-1,-1,-1,-1,-1,-1,-1,-1,-1,-1,-1,-1,-1,-1,-1,-1,-1,72]
[64,"SW",27.488243421017653,3.6195057951196192,26.951649651322015,196.29110319452616,189.62844256848689,0.46029234959012821,3.5238948815756594,9,2,4.8100704850157334E-2,3.8708352115433352E-2,0.99359909089996679,1,1,183.86362160475309,23.859546519570429,28.088090045452738,20.683306294969931,256.49456446474619,{"$f":"IF(AND(NAErr<>$L62,NAErr<>$M62),$M62/$L62,NAErr)","v":0.80473565275222236},{"$f":"IF(AND($E62<>NAErr,$C62<>NAErr),$E62/$C62,NAErr)","v":0.98047915388855456},{"$f":"IF(AND($E62<>NAErr,$C62<>NAErr),$D62*PI()*($C62/200)^2,NAErr)","v":0.21479943454703163},{"$f":"IF($C62=NAErr,NAErr,SUM(IF(trUtil,(trDbh>$C62)*trBaHa,0)))","v":14.939139464091241},{"$f":"IF($C62=NAErr,NAErr,SUM(IF(trUtil,(trDbh>$C62)*trBaHa*(trSppgrp=\"Con\"),0)))","v":6.1863404191196372},{"$f":"IF($C62=NAErr,NAErr,SUM(IF(trUtil,(trDbh>$C62)*trBaHa*(trSppgrp=\"Dec\"),0)))","v":8.7527990449716082},{"$f":"IF(ISERROR($O62),NAErr,INDEX(INDIRECT(\"SpeciesList!SppGrp\"),$O62))","v":"Con"},{"$f":"IF(ISERROR($O62),NAErr,INDEX(INDIRECT(\"SpeciesList!MGM\"),$O62))","v":"Sw"},{"$f":"IF($C62<>NAErr,PERCENTRANK(trDbh,$C62),NAErr)","v":0.36899999999999999},{"$f":"volest($O62 - 1, $C62, $E62)","v":0.64791325167831304},{"$f":"isutilized($O62, $C62)","v":true},{"$f":"ROUND(VRF($B62),3)","v":1},{"$f":"isjuveniletree($C62)","v":false},{"$f":"SUM(IF(trUtil,(trDbh>$C62)*trBaHa*(trMGMSpp=\"Sw\"),0))","v":6.1863404191196372},{"$f":"SUM(IF(trUtil,(trDbh>$C62)*trBaHa*(trMGMSpp=\"Pl\"),0))","v":0},{"$f":"SUM(IF(trUtil,(trDbh>$C62)*trDbh*trpha*(trSppgrp=\"Dec\"),0))","v":2659.785164928609},{"$f":"SUM(IF(trUtil,(trDbh>$C62)*trDbh*trpha*(trMGMSpp=\"Sw\"),0))","v":2642.9433436605113},{"$f":"SUM(IF(trUtil,(trDbh>$C62)*trDbh*trpha*(trMGMSpp=\"Pl\"),0))","v":0},{"$f":"SUM(IF(trUtil,(trDbh>$C62)*trDbh*trpha*(trMGMSpp=\"Sb\"),0))","v":0},{"$f":"IF(AND(($C62-$L62)>0,$L62>0),$AE62-MAX(0,volest($O62-1,$C62-$L62,$E62-$M62)),0)","v":3.0731753411175067E-3},-1,-1,-1,-1,-1,-1,-1,-1,-1,-1,-1,-1,-1,-1,-1,-1,-1,-1,-1,44]
[1,"AW",27.223449933097111,2.3267718728326527,24.407591390349424,196.12787403198581,194.171227005285,0.28612236601790847,4.8407028781474493,71,92,3.6792010763322003E-2,2.7294060251791936E-2,0.98722796979508232,3,3,215.39702372563022,45.904436223897655,33.201344662820766,5.703899134321941,300.2067037466706,{"$f":"IF(AND(NAErr<>$L63,NAErr<>$M63),$M63/$L63,NAErr)","v":0.74184747409895346},{"$f":"IF(AND($E63<>NAErr,$C63<>NAErr),$E63/$C63,NAErr)","v":0.89656496330671576},{"$f":"IF(AND($E63<>NAErr,$C63<>NAErr),$D63*PI()*($C63/200)^2,NAErr)","v":0.13543471822656664},{"$f":"IF($C63=NAErr,NAErr,SUM(IF(trUtil,(trDbh>$C63)*trBaHa,0)))","v":15.153938898638273},{"$f":"IF($C63=NAErr,NAErr,SUM(IF(trUtil,(trDbh>$C63)*trBaHa*(trSppgrp=\"Con\"),0)))","v":6.4011398536666686},{"$f":"IF($C63=NAErr,NAErr,SUM(IF(trUtil,(trDbh>$C63)*trBaHa*(trSppgrp=\"Dec\"),0)))","v":8.7527990449716082},{"$f":"IF(ISERROR($O63),NAErr,INDEX(INDIRECT(\"SpeciesList!SppGrp\"),$O63))","v":"Dec"},{"$f":"IF(ISERROR($O63),NAErr,INDEX(INDIRECT(\"SpeciesList!MGM\"),$O63))","v":"Aw"},{"$f":"IF($C63<>NAErr,PERCENTRANK(trDbh,$C63),NAErr)","v":0.35299999999999998},{"$f":"volest($O63 - 1, $C63, $E63)","v":0.58949796489708639},{"$f":"isutilized($O63, $C63)","v":true},{"$f":"ROUND(VRF($B63),3)","v":1},{"$f":"isjuveniletree($C63)","v":false},{"$f":"SUM(IF(trUtil,(trDbh>$C63)*trBaHa*(trMGMSpp=\"Sw\"),0))","v":6.4011398536666686},{"$f":"SUM(IF(trUtil,(trDbh>$C63)*trBaHa*(trMGMSpp=\"Pl\"),0))","v":0},{"$f":"SUM(IF(trUtil,(trDbh>$C63)*trDbh*trpha*(trSppgrp=\"Dec\"),0))","v":2659.785164928609},{"$f":"SUM(IF(trUtil,(trDbh>$C63)*trDbh*trpha*(trMGMSpp=\"Sw\"),0))","v":2742.4372000205435},{"$f":"SUM(IF(trUtil,(trDbh>$C63)*trDbh*trpha*(trMGMSpp=\"Pl\"),0))","v":0},{"$f":"SUM(IF(trUtil,(trDbh>$C63)*trDbh*trpha*(trMGMSpp=\"Sb\"),0))","v":0},{"$f":"IF(AND(($C63-$L63)>0,$L63>0),$AE63-MAX(0,volest($O63-1,$C63-$L63,$E63-$M63)),0)","v":2.1876221195671341E-3},-1,-1,-1,-1,-1,-1,-1,-1,-1,-1,-1,-1,-1,-1,-1,-1,-1,-1,-1,50]
[60,"SW",27.130693617612582,3.5413307135491059,26.772250130454601,196.18367923615006,189.52101861011079,0.45841584505175792,3.4902852000555828,12,82,4.7923382545515612E-2,3.8628302126614875E-2,0.9935422276699265,1,1,177.76240222588194,23.1511018859713,27.332670211816421,20.289832780697292,248.53600710436694,{"$f":"IF(AND(NAErr<>$L64,NAErr<>$M64),$M64/$L64,NAErr)","v":0.80604289753394054},{"$f":"IF(AND($E64<>NAErr,$C64<>NAErr),$E64/$C64,NAErr)","v":0.98678826674282705},{"$f":"IF(AND($E64<>NAErr,$C64<>NAErr),$D64*PI()*($C64/200)^2,NAErr)","v":0.20472843253955164},{"$f":"IF($C64=NAErr,NAErr,SUM(IF(trUtil,(trDbh>$C64)*trBaHa,0)))","v":15.28937361686484},{"$f":"IF($C64=NAErr,NAErr,SUM(IF(trUtil,(trDbh>$C64)*trBaHa*(trSppgrp=\"Con\"),0)))","v":6.4011398536666686},{"$f":"IF($C64=NAErr,NAErr,SUM(IF(trUtil,(trDbh>$C64)*trBaHa*(trSppgrp=\"Dec\"),0)))","v":8.8882337631981745},{"$f":"IF(ISERROR($O64),NAErr,INDEX(INDIRECT(\"SpeciesList!SppGrp\"),$O64))","v":"Con"},{"$f":"IF(ISERROR($O64),NAErr,INDEX(INDIRECT(\"SpeciesList!MGM\"),$O64))","v":"Sw"},{"$f":"IF($C64<>NAErr,PERCENTRANK(trDbh,$C64),NAErr)","v":0.33800000000000002},{"$f":"volest($O64 - 1, $C64, $E64)","v":0.62786617846153003},{"$f":"isutilized($O64, $C64)","v":true},{"$f":"ROUND(VRF($B64),3)","v":1},{"$f":"isjuveniletree($C64)","v":false},{"$f":"SUM(IF(trUtil,(trDbh>$C64)*trBaHa*(trMGMSpp=\"Sw\"),0))","v":6.4011398536666686},{"$f":"SUM(IF(trUtil,(trDbh>$C64)*trBaHa*(trMGMSpp=\"Pl\"),0))","v":0},{"$f":"SUM(IF(trUtil,(trDbh>$C64)*trDbh*trpha*(trSppgrp=\"Dec\"),0))","v":2723.1279225144071},{"$f":"SUM(IF(trUtil,(trDbh>$C64)*trDbh*trpha*(trMGMSpp=\"Sw\"),0))","v":2742.4372000205435},{"$f":"SUM(IF(trUtil,(trDbh>$C64)*trDbh*trpha*(trMGMSpp=\"Pl\"),0))","v":0},{"$f":"SUM(IF(trUtil,(trDbh>$C64)*trDbh*trpha*(trMGMSpp=\"Sb\"),0))","v":0},{"$f":"IF(AND(($C64-$L64)>0,$L64>0),$AE64-MAX(0,volest($O64-1,$C64-$L64,$E64-$M64)),0)","v":3.0025674836404725E-3},-1,-1,-1,-1,-1,-1,-1,-1,-1,-1,-1,-1,-1,-1,-1,-1,-1,-1,-1,12]
[54,"SW",26.938357883745965,3.486605072365375,26.563113755881794,195.68492864729137,189.0222680212521,0.45933064763267695,3.4722056410721205,31,65,4.7947802944323312E-2,3.8719246337700255E-2,0.99350823519821607,1,1,174.53237805309573,22.774999592771955,26.93073554642886,20.079170270194435,244.31728346249096,{"$f":"IF(AND(NAErr<>$L65,NAErr<>$M65),$M65/$L65,NAErr)","v":0.80752910373517639},{"$f":"IF(AND($E65<>NAErr,$C65<>NAErr),$E65/$C65,NAErr)","v":0.98607026718244817},{"$f":"IF(AND($E65<>NAErr,$C65<>NAErr),$D65*PI()*($C65/200)^2,NAErr)","v":0.19871693302528126},{"$f":"IF($C65=NAErr,NAErr,SUM(IF(trUtil,(trDbh>$C65)*trBaHa,0)))","v":15.494102049404392},{"$f":"IF($C65=NAErr,NAErr,SUM(IF(trUtil,(trDbh>$C65)*trBaHa*(trSppgrp=\"Con\"),0)))","v":6.6058682862062206},{"$f":"IF($C65=NAErr,NAErr,SUM(IF(trUtil,(trDbh>$C65)*trBaHa*(trSppgrp=\"Dec\"),0)))","v":8.8882337631981745},{"$f":"IF(ISERROR($O65),NAErr,INDEX(INDIRECT(\"SpeciesList!SppGrp\"),$O65))","v":"Con"},{"$f":"IF(ISERROR($O65),NAErr,INDEX(INDIRECT(\"SpeciesList!MGM\"),$O65))","v":"Sw"},{"$f":"IF($C65<>NAErr,PERCENTRANK(trDbh,$C65),NAErr)","v":0.32300000000000001},{"$f":"volest($O65 - 1, $C65, $E65)","v":0.61460410973167501},{"$f":"isutilized($O65, $C65)","v":true},{"$f":"ROUND(VRF($B65),3)","v":1},{"$f":"isjuveniletree($C65)","v":false},{"$f":"SUM(IF(trUtil,(trDbh>$C65)*trBaHa*(trMGMSpp=\"Sw\"),0))","v":6.6058682862062206},{"$f":"SUM(IF(trUtil,(trDbh>$C65)*trBaHa*(trMGMSpp=\"Pl\"),0))","v":0},{"$f":"SUM(IF(trUtil,(trDbh>$C65)*trDbh*trpha*(trSppgrp=\"Dec\"),0))","v":2723.1279225144071},{"$f":"SUM(IF(trUtil,(trDbh>$C65)*trDbh*trpha*(trMGMSpp=\"Sw\"),0))","v":2838.5159586084856},{"$f":"SUM(IF(trUtil,(trDbh>$C65)*trDbh*trpha*(trMGMSpp=\"Pl\"),0))","v":0},{"$f":"SUM(IF(trUtil,(trDbh>$C65)*trDbh*trpha*(trMGMSpp=\"Sb\"),0))","v":0},{"$f":"IF(AND(($C65-$L65)>0,$L65>0),$AE65-MAX(0,volest($O65-1,$C65-$L65,$E65-$M65)),0)","v":2.9643346856788044E-3},-1,-1,-1,-1,-1,-1,-1,-1,-1,-1,-1,-1,-1,-1,-1,-1,-1,-1,-1,74]
[53,"SW",26.7224257936168,3.4393083077502031,26.395988664085941,195.45501229732972,188.79235167129045,0.45919077242018669,3.4519080245999794,88,48,4.7858887610753999E-2,3.8717124521220371E-2,0.9934714424120612,1,1,170.9491826237543,22.356902846381058,26.483176802592087,19.843498719889784,239.63276099261722,{"$f":"IF(AND(NAErr<>$L66,NAErr<>$M66),$M66/$L66,NAErr)","v":0.8089850486311877},{"$f":"IF(AND($E66<>NAErr,$C66<>NAErr),$E66/$C66,NAErr)","v":0.98778415058378288},{"$f":"IF(AND($E66<>NAErr,$C66<>NAErr),$D66*PI()*($C66/200)^2,NAErr)","v":0.19289134865534902},{"$f":"IF($C66=NAErr,NAErr,SUM(IF(trUtil,(trDbh>$C66)*trBaHa,0)))","v":15.692818982429673},{"$f":"IF($C66=NAErr,NAErr,SUM(IF(trUtil,(trDbh>$C66)*trBaHa*(trSppgrp=\"Con\"),0)))","v":6.8045852192315017},{"$f":"IF($C66=NAErr,NAErr,SUM(IF(trUtil,(trDbh>$C66)*trBaHa*(trSppgrp=\"Dec\"),0)))","v":8.8882337631981745},{"$f":"IF(ISERROR($O66),NAErr,INDEX(INDIRECT(\"SpeciesList!SppGrp\"),$O66))","v":"Con"},{"$f":"IF(ISERROR($O66),NAErr,INDEX(INDIRECT(\"SpeciesList!MGM\"),$O66))","v":"Sw"},{"$f":"IF($C66<>NAErr,PERCENTRANK(trDbh,$C66),NAErr)","v":0.307},{"$f":"volest($O66 - 1, $C66, $E66)","v":0.60149423171733396},{"$f":"isutilized($O66, $C66)","v":true},{"$f":"ROUND(VRF($B66),3)","v":1},{"$f":"isjuveniletree($C66)","v":false},{"$f":"SUM(IF(trUtil,(trDbh>$C66)*trBaHa*(trMGMSpp=\"Sw\"),0))","v":6.8045852192315017},{"$f":"SUM(IF(trUtil,(trDbh>$C66)*trBaHa*(trMGMSpp=\"Pl\"),0))","v":0},{"$f":"SUM(IF(trUtil,(trDbh>$C66)*trDbh*trpha*(trSppgrp=\"Dec\"),0))","v":2723.1279225144071},{"$f":"SUM(IF(trUtil,(trDbh>$C66)*trDbh*trpha*(trMGMSpp=\"Sw\"),0))","v":2932.4393738471481},{"$f":"SUM(IF(trUtil,(trDbh>$C66)*trDbh*trpha*(trMGMSpp=\"Pl\"),0))","v":0},{"$f":"SUM(IF(trUtil,(trDbh>$C66)*trDbh*trpha*(trMGMSpp=\"Sb\"),0))","v":0},{"$f":"IF(AND(($C66-$L66)>0,$L66>0),$AE66-MAX(0,volest($O66-1,$C66-$L66,$E66-$M66)),0)","v":2.919610636832326E-3},-1,-1,-1,-1,-1,-1,-1,-1,-1,-1,-1,-1,-1,-1,-1,-1,-1,-1,-1,59]
[57,"SW",26.532447284141927,3.4227286840197659,26.594224764550933,196.43649588262176,189.77383525658246,0.45310268147275218,3.4340500447093412,86,83,4.7247498176072059E-2,3.8290043206067575E-2,0.99343697472724046,1,1,167.83420091796512,21.992677833220512,26.092634342910515,19.636887214134802,235.55640030823093,{"$f":"IF(AND(NAErr<>$L67,NAErr<>$M67),$M67/$L67,NAErr)","v":0.81041419512576685},{"$f":"IF(AND($E67<>NAErr,$C67<>NAErr),$E67/$C67,NAErr)","v":1.0023283747536522},{"$f":"IF(AND($E67<>NAErr,$C67<>NAErr),$D67*PI()*($C67/200)^2,NAErr)","v":0.18924175887504899},{"$f":"IF($C67=NAErr,NAErr,SUM(IF(trUtil,(trDbh>$C67)*trBaHa,0)))","v":15.885710331085022},{"$f":"IF($C67=NAErr,NAErr,SUM(IF(trUtil,(trDbh>$C67)*trBaHa*(trSppgrp=\"Con\"),0)))","v":6.9974765678868511},{"$f":"IF($C67=NAErr,NAErr,SUM(IF(trUtil,(trDbh>$C67)*trBaHa*(trSppgrp=\"Dec\"),0)))","v":8.8882337631981745},{"$f":"IF(ISERROR($O67),NAErr,INDEX(INDIRECT(\"SpeciesList!SppGrp\"),$O67))","v":"Con"},{"$f":"IF(ISERROR($O67),NAErr,INDEX(INDIRECT(\"SpeciesList!MGM\"),$O67))","v":"Sw"},{"$f":"IF($C67<>NAErr,PERCENTRANK(trDbh,$C67),NAErr)","v":0.29199999999999998},{"$f":"volest($O67 - 1, $C67, $E67)","v":0.59796937554909335},{"$f":"isutilized($O67, $C67)","v":true},{"$f":"ROUND(VRF($B67),3)","v":1},{"$f":"isjuveniletree($C67)","v":false},{"$f":"SUM(IF(trUtil,(trDbh>$C67)*trBaHa*(trMGMSpp=\"Sw\"),0))","v":6.9974765678868511},{"$f":"SUM(IF(trUtil,(trDbh>$C67)*trBaHa*(trMGMSpp=\"Pl\"),0))","v":0},{"$f":"SUM(IF(trUtil,(trDbh>$C67)*trDbh*trpha*(trSppgrp=\"Dec\"),0))","v":2723.1279225144071},{"$f":"SUM(IF(trUtil,(trDbh>$C67)*trDbh*trpha*(trMGMSpp=\"Sw\"),0))","v":3024.3460348823728},{"$f":"SUM(IF(trUtil,(trDbh>$C67)*trDbh*trpha*(trMGMSpp=\"Pl\"),0))","v":0},{"$f":"SUM(IF(trUtil,(trDbh>$C67)*trDbh*trpha*(trMGMSpp=\"Sb\"),0))","v":0},{"$f":"IF(AND(($C67-$L67)>0,$L67>0),$AE67-MAX(0,volest($O67-1,$C67-$L67,$E67-$M67)),0)","v":2.8751543993024153E-3},-1,-1,-1,-1,-1,-1,-1,-1,-1,-1,-1,-1,-1,-1,-1,-1,-1,-1,-1,78]
[47,"SW",26.431193900315701,3.3648186686923172,26.004786821978172,194.55355884605774,187.89089822001847,0.46191888452977153,3.424532226629676,78,35,4.7886149718551513E-2,3.8875144929419472E-2,0.99341194694408441,1,1,166.18830212954254,21.799937162994006,25.885717544346331,19.527050491248239,233.40100732813113,{"$f":"IF(AND(NAErr<>$L68,NAErr<>$M68),$M68/$L68,NAErr)","v":0.81182440346334428},{"$f":"IF(AND($E68<>NAErr,$C68<>NAErr),$E68/$C68,NAErr)","v":0.98386727894526038},{"$f":"IF(AND($E68<>NAErr,$C68<>NAErr),$D68*PI()*($C68/200)^2,NAErr)","v":0.18462270412647191},{"$f":"IF($C68=NAErr,NAErr,SUM(IF(trUtil,(trDbh>$C68)*trBaHa,0)))","v":16.074952089960071},{"$f":"IF($C68=NAErr,NAErr,SUM(IF(trUtil,(trDbh>$C68)*trBaHa*(trSppgrp=\"Con\"),0)))","v":7.1867183267619001},{"$f":"IF($C68=NAErr,NAErr,SUM(IF(trUtil,(trDbh>$C68)*trBaHa*(trSppgrp=\"Dec\"),0)))","v":8.8882337631981745},{"$f":"IF(ISERROR($O68),NAErr,INDEX(INDIRECT(\"SpeciesList!SppGrp\"),$O68))","v":"Con"},{"$f":"IF(ISERROR($O68),NAErr,INDEX(INDIRECT(\"SpeciesList!MGM\"),$O68))","v":"Sw"},{"$f":"IF($C68<>NAErr,PERCENTRANK(trDbh,$C68),NAErr)","v":0.27600000000000002},{"$f":"volest($O68 - 1, $C68, $E68)","v":0.58035292782457271},{"$f":"isutilized($O68, $C68)","v":true},{"$f":"ROUND(VRF($B68),3)","v":1},{"$f":"isjuveniletree($C68)","v":false},{"$f":"SUM(IF(trUtil,(trDbh>$C68)*trBaHa*(trMGMSpp=\"Sw\"),0))","v":7.1867183267619001},{"$f":"SUM(IF(trUtil,(trDbh>$C68)*trBaHa*(trMGMSpp=\"Pl\"),0))","v":0},{"$f":"SUM(IF(trUtil,(trDbh>$C68)*trDbh*trpha*(trSppgrp=\"Dec\"),0))","v":2723.1279225144071},{"$f":"SUM(IF(trUtil,(trDbh>$C68)*trDbh*trpha*(trMGMSpp=\"Sw\"),0))","v":3115.1594032590478},{"$f":"SUM(IF(trUtil,(trDbh>$C68)*trDbh*trpha*(trMGMSpp=\"Pl\"),0))","v":0},{"$f":"SUM(IF(trUtil,(trDbh>$C68)*trDbh*trpha*(trMGMSpp=\"Sb\"),0))","v":0},{"$f":"IF(AND(($C68-$L68)>0,$L68>0),$AE68-MAX(0,volest($O68-1,$C68-$L68,$E68-$M68)),0)","v":2.85671385801467E-3},-1,-1,-1,-1,-1,-1,-1,-1,-1,-1,-1,-1,-1,-1,-1,-1,-1,-1,-1,79]
[80,"SW",26.301711131882382,3.3637206376821136,26.387139768455391,196.04423698230158,189.38157635626231,0.45339176051118224,3.4123608463969437,49,59,4.7058874811974072E-2,3.826889324720819E-2,0.99338380586185937,1,1,164.09797356419759,21.554857817136664,25.62235985306663,19.386877462269194,230.66206869667005,{"$f":"IF(AND(NAErr<>$L69,NAErr<>$M69),$M69/$L69,NAErr)","v":0.81321309530058539},{"$f":"IF(AND($E69<>NAErr,$C69<>NAErr),$E69/$C69,NAErr)","v":1.0032480258088401},{"$f":"IF(AND($E69<>NAErr,$C69<>NAErr),$D69*PI()*($C69/200)^2,NAErr)","v":0.18275859407850803},{"$f":"IF($C69=NAErr,NAErr,SUM(IF(trUtil,(trDbh>$C69)*trBaHa,0)))","v":16.259574794086543},{"$f":"IF($C69=NAErr,NAErr,SUM(IF(trUtil,(trDbh>$C69)*trBaHa*(trSppgrp=\"Con\"),0)))","v":7.371341030888372},{"$f":"IF($C69=NAErr,NAErr,SUM(IF(trUtil,(trDbh>$C69)*trBaHa*(trSppgrp=\"Dec\"),0)))","v":8.8882337631981745},{"$f":"IF(ISERROR($O69),NAErr,INDEX(INDIRECT(\"SpeciesList!SppGrp\"),$O69))","v":"Con"},{"$f":"IF(ISERROR($O69),NAErr,INDEX(INDIRECT(\"SpeciesList!MGM\"),$O69))","v":"Sw"},{"$f":"IF($C69<>NAErr,PERCENTRANK(trDbh,$C69),NAErr)","v":0.26100000000000001},{"$f":"volest($O69 - 1, $C69, $E69)","v":0.58356303549584265},{"$f":"isutilized($O69, $C69)","v":true},{"$f":"ROUND(VRF($B69),3)","v":1},{"$f":"isjuveniletree($C69)","v":false},{"$f":"SUM(IF(trUtil,(trDbh>$C69)*trBaHa*(trMGMSpp=\"Sw\"),0))","v":7.371341030888372},{"$f":"SUM(IF(trUtil,(trDbh>$C69)*trBaHa*(trMGMSpp=\"Pl\"),0))","v":0},{"$f":"SUM(IF(trUtil,(trDbh>$C69)*trDbh*trpha*(trSppgrp=\"Dec\"),0))","v":2723.1279225144071},{"$f":"SUM(IF(trUtil,(trDbh>$C69)*trDbh*trpha*(trMGMSpp=\"Sw\"),0))","v":3204.0955779306564},{"$f":"SUM(IF(trUtil,(trDbh>$C69)*trDbh*trpha*(trMGMSpp=\"Pl\"),0))","v":0},{"$f":"SUM(IF(trUtil,(trDbh>$C69)*trDbh*trpha*(trMGMSpp=\"Sb\"),0))","v":0},{"$f":"IF(AND(($C69-$L69)>0,$L69>0),$AE69-MAX(0,volest($O69-1,$C69-$L69,$E69-$M69)),0)","v":2.821811304862254E-3},-1,-1,-1,-1,-1,-1,-1,-1,-1,-1,-1,-1,-1,-1,-1,-1,-1,-1,-1,48]
[42,"SW",26.088272321194573,3.2936692468220645,25.893507654853078,194.675921022132,188.01326039609273,0.45895124057821246,3.39229759819229,61,33,4.7475548072232421E-2,3.8673222909381556E-2,0.993345608422882,1,1,160.68756097100839,21.154287532202922,25.19129673818437,19.156519902629501,226.18966514402518,{"$f":"IF(AND(NAErr<>$L70,NAErr<>$M70),$M70/$L70,NAErr)","v":0.81459244768573436},{"$f":"IF(AND($E70<>NAErr,$C70<>NAErr),$E70/$C70,NAErr)","v":0.99253439768093554},{"$f":"IF(AND($E70<>NAErr,$C70<>NAErr),$D70*PI()*($C70/200)^2,NAErr)","v":0.17605992175966798},{"$f":"IF($C70=NAErr,NAErr,SUM(IF(trUtil,(trDbh>$C70)*trBaHa,0)))","v":16.44233338816505},{"$f":"IF($C70=NAErr,NAErr,SUM(IF(trUtil,(trDbh>$C70)*trBaHa*(trSppgrp=\"Con\"),0)))","v":7.5540996249668799},{"$f":"IF($C70=NAErr,NAErr,SUM(IF(trUtil,(trDbh>$C70)*trBaHa*(trSppgrp=\"Dec\"),0)))","v":8.8882337631981745},{"$f":"IF(ISERROR($O70),NAErr,INDEX(INDIRECT(\"SpeciesList!SppGrp\"),$O70))","v":"Con"},{"$f":"IF(ISERROR($O70),NAErr,INDEX(INDIRECT(\"SpeciesList!MGM\"),$O70))","v":"Sw"},{"$f":"IF($C70<>NAErr,PERCENTRANK(trDbh,$C70),NAErr)","v":0.246},{"$f":"volest($O70 - 1, $C70, $E70)","v":0.56377939226451201},{"$f":"isutilized($O70, $C70)","v":true},{"$f":"ROUND(VRF($B70),3)","v":1},{"$f":"isjuveniletree($C70)","v":false},{"$f":"SUM(IF(trUtil,(trDbh>$C70)*trBaHa*(trMGMSpp=\"Sw\"),0))","v":7.5540996249668799},{"$f":"SUM(IF(trUtil,(trDbh>$C70)*trBaHa*(trMGMSpp=\"Pl\"),0))","v":0},{"$f":"SUM(IF(trUtil,(trDbh>$C70)*trDbh*trpha*(trSppgrp=\"Dec\"),0))","v":2723.1279225144071},{"$f":"SUM(IF(trUtil,(trDbh>$C70)*trDbh*trpha*(trMGMSpp=\"Sw\"),0))","v":3292.5671864713227},{"$f":"SUM(IF(trUtil,(trDbh>$C70)*trDbh*trpha*(trMGMSpp=\"Pl\"),0))","v":0},{"$f":"SUM(IF(trUtil,(trDbh>$C70)*trDbh*trpha*(trMGMSpp=\"Sb\"),0))","v":0},{"$f":"IF(AND(($C70-$L70)>0,$L70>0),$AE70-MAX(0,volest($O70-1,$C70-$L70,$E70-$M70)),0)","v":2.7836154250072687E-3},-1,-1,-1,-1,-1,-1,-1,-1,-1,-1,-1,-1,-1,-1,-1,-1,-1,-1,-1,56]
[49,"SW",25.961313432812791,3.3067402136821862,26.335417628656657,196.43828691844649,189.77562629240722,0.44944440915459488,3.3803634626844024,33,25,4.6545936921732547E-2,3.7978657118561542E-2,0.99331741950937635,1,1,158.67971652755057,20.918032189856177,24.936691966183705,19.0199137341768,223.55435441776726,{"$f":"IF(AND(NAErr<>$L71,NAErr<>$M71),$M71/$L71,NAErr)","v":0.81593925550200075},{"$f":"IF(AND($E71<>NAErr,$C71<>NAErr),$E71/$C71,NAErr)","v":1.0144100642986358},{"$f":"IF(AND($E71<>NAErr,$C71<>NAErr),$D71*PI()*($C71/200)^2,NAErr)","v":0.17504240804269142},{"$f":"IF($C71=NAErr,NAErr,SUM(IF(trUtil,(trDbh>$C71)*trBaHa,0)))","v":16.618393309924716},{"$f":"IF($C71=NAErr,NAErr,SUM(IF(trUtil,(trDbh>$C71)*trBaHa*(trSppgrp=\"Con\"),0)))","v":7.730159546726548},{"$f":"IF($C71=NAErr,NAErr,SUM(IF(trUtil,(trDbh>$C71)*trBaHa*(trSppgrp=\"Dec\"),0)))","v":8.8882337631981745},{"$f":"IF(ISERROR($O71),NAErr,INDEX(INDIRECT(\"SpeciesList!SppGrp\"),$O71))","v":"Con"},{"$f":"IF(ISERROR($O71),NAErr,INDEX(INDIRECT(\"SpeciesList!MGM\"),$O71))","v":"Sw"},{"$f":"IF($C71<>NAErr,PERCENTRANK(trDbh,$C71),NAErr)","v":0.23},{"$f":"volest($O71 - 1, $C71, $E71)","v":0.56826631200019484},{"$f":"isutilized($O71, $C71)","v":true},{"$f":"ROUND(VRF($B71),3)","v":1},{"$f":"isjuveniletree($C71)","v":false},{"$f":"SUM(IF(trUtil,(trDbh>$C71)*trBaHa*(trMGMSpp=\"Sw\"),0))","v":7.730159546726548},{"$f":"SUM(IF(trUtil,(trDbh>$C71)*trBaHa*(trMGMSpp=\"Pl\"),0))","v":0},{"$f":"SUM(IF(trUtil,(trDbh>$C71)*trDbh*trpha*(trSppgrp=\"Dec\"),0))","v":2723.1279225144071},{"$f":"SUM(IF(trUtil,(trDbh>$C71)*trDbh*trpha*(trMGMSpp=\"Sw\"),0))","v":3378.4933267183605},{"$f":"SUM(IF(trUtil,(trDbh>$C71)*trDbh*trpha*(trMGMSpp=\"Pl\"),0))","v":0},{"$f":"SUM(IF(trUtil,(trDbh>$C71)*trDbh*trpha*(trMGMSpp=\"Sb\"),0))","v":0},{"$f":"IF(AND(($C71-$L71)>0,$L71>0),$AE71-MAX(0,volest($O71-1,$C71-$L71,$E71-$M71)),0)","v":2.7478154802885735E-3},-1,-1,-1,-1,-1,-1,-1,-1,-1,-1,-1,-1,-1,-1,-1,-1,-1,-1,-1,37]
[71,"SW",25.843910100461738,3.2734505297193723,26.184331239891236,196.09689960970903,189.43423898366976,0.45035710015765384,3.3693275494434034,52,31,4.6502907253234131E-2,3.7996507296862395E-2,0.99328352894536409,1,1,156.83672497216529,20.700893312495896,24.702446106864524,18.893866529739334,221.13393092126506,{"$f":"IF(AND(NAErr<>$L72,NAErr<>$M72),$M72/$L72,NAErr)","v":0.81707810416992488},{"$f":"IF(AND($E72<>NAErr,$C72<>NAErr),$E72/$C72,NAErr)","v":1.0131721994894038},{"$f":"IF(AND($E72<>NAErr,$C72<>NAErr),$D72*PI()*($C72/200)^2,NAErr)","v":0.17171653113668225},{"$f":"IF($C72=NAErr,NAErr,SUM(IF(trUtil,(trDbh>$C72)*trBaHa,0)))","v":16.793435717967409},{"$f":"IF($C72=NAErr,NAErr,SUM(IF(trUtil,(trDbh>$C72)*trBaHa*(trSppgrp=\"Con\"),0)))","v":7.9052019547692396},{"$f":"IF($C72=NAErr,NAErr,SUM(IF(trUtil,(trDbh>$C72)*trBaHa*(trSppgrp=\"Dec\"),0)))","v":8.8882337631981745},{"$f":"IF(ISERROR($O72),NAErr,INDEX(INDIRECT(\"SpeciesList!SppGrp\"),$O72))","v":"Con"},{"$f":"IF(ISERROR($O72),NAErr,INDEX(INDIRECT(\"SpeciesList!MGM\"),$O72))","v":"Sw"},{"$f":"IF($C72<>NAErr,PERCENTRANK(trDbh,$C72),NAErr)","v":0.215},{"$f":"volest($O72 - 1, $C72, $E72)","v":0.56015457644569555},{"$f":"isutilized($O72, $C72)","v":true},{"$f":"ROUND(VRF($B72),3)","v":1},{"$f":"isjuveniletree($C72)","v":false},{"$f":"SUM(IF(trUtil,(trDbh>$C72)*trBaHa*(trMGMSpp=\"Sw\"),0))","v":7.9052019547692396},{"$f":"SUM(IF(trUtil,(trDbh>$C72)*trBaHa*(trMGMSpp=\"Pl\"),0))","v":0},{"$f":"SUM(IF(trUtil,(trDbh>$C72)*trDbh*trpha*(trSppgrp=\"Dec\"),0))","v":2723.1279225144071},{"$f":"SUM(IF(trUtil,(trDbh>$C72)*trDbh*trpha*(trMGMSpp=\"Sw\"),0))","v":3464.3406458466502},{"$f":"SUM(IF(trUtil,(trDbh>$C72)*trDbh*trpha*(trMGMSpp=\"Pl\"),0))","v":0},{"$f":"SUM(IF(trUtil,(trDbh>$C72)*trDbh*trpha*(trMGMSpp=\"Sb\"),0))","v":0},{"$f":"IF(AND(($C72-$L72)>0,$L72>0),$AE72-MAX(0,volest($O72-1,$C72-$L72,$E72-$M72)),0)","v":2.7207366352470785E-3},-1,-1,-1,-1,-1,-1,-1,-1,-1,-1,-1,-1,-1,-1,-1,-1,-1,-1,-1,64]
[16,"AW",25.83099131420116,2.1631354612683968,25.362290684670189,198.73691790575452,196.78027087905372,0.26786067136614927,4.6701239044020486,32,33,3.177830550540893E-2,2.6038513488936918E-2,0.98681127403932178,3,3,189.14920978912937,40.480506549190622,29.084559422302128,5.2359478626752534,263.95022362329735,{"$f":"IF(AND(NAErr<>$L73,NAErr<>$M73),$M73/$L73,NAErr)","v":0.81938017382660466},{"$f":"IF(AND($E73<>NAErr,$C73<>NAErr),$E73/$C73,NAErr)","v":0.98185510483009253},{"$f":"IF(AND($E73<>NAErr,$C73<>NAErr),$D73*PI()*($C73/200)^2,NAErr)","v":0.11335893186867198},{"$f":"IF($C73=NAErr,NAErr,SUM(IF(trUtil,(trDbh>$C73)*trBaHa,0)))","v":16.96515224910409},{"$f":"IF($C73=NAErr,NAErr,SUM(IF(trUtil,(trDbh>$C73)*trBaHa*(trSppgrp=\"Con\"),0)))","v":8.0769184859059227},{"$f":"IF($C73=NAErr,NAErr,SUM(IF(trUtil,(trDbh>$C73)*trBaHa*(trSppgrp=\"Dec\"),0)))","v":8.8882337631981745},{"$f":"IF(ISERROR($O73),NAErr,INDEX(INDIRECT(\"SpeciesList!SppGrp\"),$O73))","v":"Dec"},{"$f":"IF(ISERROR($O73),NAErr,INDEX(INDIRECT(\"SpeciesList!MGM\"),$O73))","v":"Aw"},{"$f":"IF($C73<>NAErr,PERCENTRANK(trDbh,$C73),NAErr)","v":0.2},{"$f":"volest($O73 - 1, $C73, $E73)","v":0.5542850537535976},{"$f":"isutilized($O73, $C73)","v":true},{"$f":"ROUND(VRF($B73),3)","v":1},{"$f":"isjuveniletree($C73)","v":false},{"$f":"SUM(IF(trUtil,(trDbh>$C73)*trBaHa*(trMGMSpp=\"Sw\"),0))","v":8.0769184859059227},{"$f":"SUM(IF(trUtil,(trDbh>$C73)*trBaHa*(trMGMSpp=\"Pl\"),0))","v":0},{"$f":"SUM(IF(trUtil,(trDbh>$C73)*trDbh*trpha*(trSppgrp=\"Dec\"),0))","v":2723.1279225144071},{"$f":"SUM(IF(trUtil,(trDbh>$C73)*trDbh*trpha*(trMGMSpp=\"Sw\"),0))","v":3548.9394070550265},{"$f":"SUM(IF(trUtil,(trDbh>$C73)*trDbh*trpha*(trMGMSpp=\"Pl\"),0))","v":0},{"$f":"SUM(IF(trUtil,(trDbh>$C73)*trDbh*trpha*(trMGMSpp=\"Sb\"),0))","v":0},{"$f":"IF(AND(($C73-$L73)>0,$L73>0),$AE73-MAX(0,volest($O73-1,$C73-$L73,$E73-$M73)),0)","v":1.8800584049213365E-3},-1,-1,-1,-1,-1,-1,-1,-1,-1,-1,-1,-1,-1,-1,-1,-1,-1,-1,-1,55]
[18,"AW",25.696688234017063,1.9316114565424791,23.187381597643238,195.79146086541374,193.83481383871293,0.29217014938995439,4.6533024198624329,61,57,3.2070966841963318E-2,2.6552685582266873E-2,0.9867428039288294,3,3,186.72451256511263,39.97827778651358,28.704781591375561,5.1916358365426554,260.59920777954443,{"$f":"IF(AND(NAErr<>$L74,NAErr<>$M74),$M74/$L74,NAErr)","v":0.82793530089413958},{"$f":"IF(AND($E74<>NAErr,$C74<>NAErr),$E74/$C74,NAErr)","v":0.90234902593198663},{"$f":"IF(AND($E74<>NAErr,$C74<>NAErr),$D74*PI()*($C74/200)^2,NAErr)","v":0.10017606421921971},{"$f":"IF($C74=NAErr,NAErr,SUM(IF(trUtil,(trDbh>$C74)*trBaHa,0)))","v":17.078511180972761},{"$f":"IF($C74=NAErr,NAErr,SUM(IF(trUtil,(trDbh>$C74)*trBaHa*(trSppgrp=\"Con\"),0)))","v":8.0769184859059227},{"$f":"IF($C74=NAErr,NAErr,SUM(IF(trUtil,(trDbh>$C74)*trBaHa*(trSppgrp=\"Dec\"),0)))","v":9.0015926950668472},{"$f":"IF(ISERROR($O74),NAErr,INDEX(INDIRECT(\"SpeciesList!SppGrp\"),$O74))","v":"Dec"},{"$f":"IF(ISERROR($O74),NAErr,INDEX(INDIRECT(\"SpeciesList!MGM\"),$O74))","v":"Aw"},{"$f":"IF($C74<>NAErr,PERCENTRANK(trDbh,$C74),NAErr)","v":0.184},{"$f":"volest($O74 - 1, $C74, $E74)","v":0.50115126891516482},{"$f":"isutilized($O74, $C74)","v":true},{"$f":"ROUND(VRF($B74),3)","v":1},{"$f":"isjuveniletree($C74)","v":false},{"$f":"SUM(IF(trUtil,(trDbh>$C74)*trBaHa*(trMGMSpp=\"Sw\"),0))","v":8.0769184859059227},{"$f":"SUM(IF(trUtil,(trDbh>$C74)*trBaHa*(trMGMSpp=\"Pl\"),0))","v":0},{"$f":"SUM(IF(trUtil,(trDbh>$C74)*trDbh*trpha*(trSppgrp=\"Dec\"),0))","v":2779.0038558258716},{"$f":"SUM(IF(trUtil,(trDbh>$C74)*trDbh*trpha*(trMGMSpp=\"Sw\"),0))","v":3548.9394070550265},{"$f":"SUM(IF(trUtil,(trDbh>$C74)*trDbh*trpha*(trMGMSpp=\"Pl\"),0))","v":0},{"$f":"SUM(IF(trUtil,(trDbh>$C74)*trDbh*trpha*(trMGMSpp=\"Sb\"),0))","v":0},{"$f":"IF(AND(($C74-$L74)>0,$L74>0),$AE74-MAX(0,volest($O74-1,$C74-$L74,$E74-$M74)),0)","v":1.7770207350435996E-3},-1,-1,-1,-1,-1,-1,-1,-1,-1,-1,-1,-1,-1,-1,-1,-1,-1,-1,-1,43]
[70,"SW",25.608884024502192,3.2198807692766933,25.997562289395233,195.76318703826578,189.10052641222651,0.45020007103916976,3.347235098303206,23,24,4.6461484560180344E-2,3.8015807823232925E-2,0.99323542508927776,1,1,153.18680476340563,20.270056131903374,24.236968196385632,18.642339827047053,216.33616891874169,{"$f":"IF(AND(NAErr<>$L75,NAErr<>$M75),$M75/$L75,NAErr)","v":0.81822197855068635},{"$f":"IF(AND($E75<>NAErr,$C75<>NAErr),$E75/$C75,NAErr)","v":1.0151774776488174},{"$f":"IF(AND($E75<>NAErr,$C75<>NAErr),$D75*PI()*($C75/200)^2,NAErr)","v":0.16584828246960859},{"$f":"IF($C75=NAErr,NAErr,SUM(IF(trUtil,(trDbh>$C75)*trBaHa,0)))","v":17.178687245191981},{"$f":"IF($C75=NAErr,NAErr,SUM(IF(trUtil,(trDbh>$C75)*trBaHa*(trSppgrp=\"Con\"),0)))","v":8.0769184859059227},{"$f":"IF($C75=NAErr,NAErr,SUM(IF(trUtil,(trDbh>$C75)*trBaHa*(trSppgrp=\"Dec\"),0)))","v":9.1017687592860668},{"$f":"IF(ISERROR($O75),NAErr,INDEX(INDIRECT(\"SpeciesList!SppGrp\"),$O75))","v":"Con"},{"$f":"IF(ISERROR($O75),NAErr,INDEX(INDIRECT(\"SpeciesList!MGM\"),$O75))","v":"Sw"},{"$f":"IF($C75<>NAErr,PERCENTRANK(trDbh,$C75),NAErr)","v":0.16900000000000001},{"$f":"volest($O75 - 1, $C75, $E75)","v":0.5466033313195251},{"$f":"isutilized($O75, $C75)","v":true},{"$f":"ROUND(VRF($B75),3)","v":1},{"$f":"isjuveniletree($C75)","v":false},{"$f":"SUM(IF(trUtil,(trDbh>$C75)*trBaHa*(trMGMSpp=\"Sw\"),0))","v":8.0769184859059227},{"$f":"SUM(IF(trUtil,(trDbh>$C75)*trBaHa*(trMGMSpp=\"Pl\"),0))","v":0},{"$f":"SUM(IF(trUtil,(trDbh>$C75)*trDbh*trpha*(trSppgrp=\"Dec\"),0))","v":2828.6398732138991},{"$f":"SUM(IF(trUtil,(trDbh>$C75)*trDbh*trpha*(trMGMSpp=\"Sw\"),0))","v":3548.9394070550265},{"$f":"SUM(IF(trUtil,(trDbh>$C75)*trDbh*trpha*(trMGMSpp=\"Pl\"),0))","v":0},{"$f":"SUM(IF(trUtil,(trDbh>$C75)*trDbh*trpha*(trMGMSpp=\"Sb\"),0))","v":0},{"$f":"IF(AND(($C75-$L75)>0,$L75>0),$AE75-MAX(0,volest($O75-1,$C75-$L75,$E75-$M75)),0)","v":2.6768540985024902E-3},-1,-1,-1,-1,-1,-1,-1,-1,-1,-1,-1,-1,-1,-1,-1,-1,-1,-1,-1,68]
[66,"SW",25.45995420423635,3.1711033990881541,25.66897752675581,194.83654575964079,188.17388513360152,0.45378312608719129,3.3332356951982169,38,30,4.6695319526939769E-2,3.8267567321329438E-2,0.99320370231648913,1,1,150.90111866935271,19.99969615489999,23.944388688090935,18.483510464918389,213.32871397726203,{"$f":"IF(AND(NAErr<>$L76,NAErr<>$M76),$M76/$L76,NAErr)","v":0.819516125149371},{"$f":"IF(AND($E76<>NAErr,$C76<>NAErr),$E76/$C76,NAErr)","v":1.0082098860368209},{"$f":"IF(AND($E76<>NAErr,$C76<>NAErr),$D76*PI()*($C76/200)^2,NAErr)","v":0.16144162517055949},{"$f":"IF($C76=NAErr,NAErr,SUM(IF(trUtil,(trDbh>$C76)*trBaHa,0)))","v":17.344535527661588},{"$f":"IF($C76=NAErr,NAErr,SUM(IF(trUtil,(trDbh>$C76)*trBaHa*(trSppgrp=\"Con\"),0)))","v":8.2427667683755317},{"$f":"IF($C76=NAErr,NAErr,SUM(IF(trUtil,(trDbh>$C76)*trBaHa*(trSppgrp=\"Dec\"),0)))","v":9.1017687592860668},{"$f":"IF(ISERROR($O76),NAErr,INDEX(INDIRECT(\"SpeciesList!SppGrp\"),$O76))","v":"Con"},{"$f":"IF(ISERROR($O76),NAErr,INDEX(INDIRECT(\"SpeciesList!MGM\"),$O76))","v":"Sw"},{"$f":"IF($C76<>NAErr,PERCENTRANK(trDbh,$C76),NAErr)","v":0.153},{"$f":"volest($O76 - 1, $C76, $E76)","v":0.53370158599975481},{"$f":"isutilized($O76, $C76)","v":true},{"$f":"ROUND(VRF($B76),3)","v":1},{"$f":"isjuveniletree($C76)","v":false},{"$f":"SUM(IF(trUtil,(trDbh>$C76)*trBaHa*(trMGMSpp=\"Sw\"),0))","v":8.2427667683755317},{"$f":"SUM(IF(trUtil,(trDbh>$C76)*trBaHa*(trMGMSpp=\"Pl\"),0))","v":0},{"$f":"SUM(IF(trUtil,(trDbh>$C76)*trDbh*trpha*(trSppgrp=\"Dec\"),0))","v":2828.6398732138991},{"$f":"SUM(IF(trUtil,(trDbh>$C76)*trDbh*trpha*(trMGMSpp=\"Sw\"),0))","v":3631.3969602481584},{"$f":"SUM(IF(trUtil,(trDbh>$C76)*trDbh*trpha*(trMGMSpp=\"Pl\"),0))","v":0},{"$f":"SUM(IF(trUtil,(trDbh>$C76)*trDbh*trpha*(trMGMSpp=\"Sb\"),0))","v":0},{"$f":"IF(AND(($C76-$L76)>0,$L76>0),$AE76-MAX(0,volest($O76-1,$C76-$L76,$E76-$M76)),0)","v":2.6491846264284913E-3},-1,-1,-1,-1,-1,-1,-1,-1,-1,-1,-1,-1,-1,-1,-1,-1,-1,-1,-1,60]
[77,"SW",25.450813225819569,3.1461885087292281,25.294979790328235,193.59704322137247,187,0.46035667170245981,3.3323764432270395,71,45,4.7042508822520583E-2,3.8611776279357773E-2,0.99319025415834028,1,1,150.761512952544,19.983168928329427,23.926490967189231,18.473775974447992,213.14494882251066,{"$f":"IF(AND(NAErr<>$L77,NAErr<>$M77),$M77/$L77,NAErr)","v":0.8207848017849172},{"$f":"IF(AND($E77<>NAErr,$C77<>NAErr),$E77/$C77,NAErr)","v":0.99387707441374629},{"$f":"IF(AND($E77<>NAErr,$C77<>NAErr),$D77*PI()*($C77/200)^2,NAErr)","v":0.16005820773276069},{"$f":"IF($C77=NAErr,NAErr,SUM(IF(trUtil,(trDbh>$C77)*trBaHa,0)))","v":17.505977152832148},{"$f":"IF($C77=NAErr,NAErr,SUM(IF(trUtil,(trDbh>$C77)*trBaHa*(trSppgrp=\"Con\"),0)))","v":8.4042083935460905},{"$f":"IF($C77=NAErr,NAErr,SUM(IF(trUtil,(trDbh>$C77)*trBaHa*(trSppgrp=\"Dec\"),0)))","v":9.1017687592860668},{"$f":"IF(ISERROR($O77),NAErr,INDEX(INDIRECT(\"SpeciesList!SppGrp\"),$O77))","v":"Con"},{"$f":"IF(ISERROR($O77),NAErr,INDEX(INDIRECT(\"SpeciesList!MGM\"),$O77))","v":"Sw"},{"$f":"IF($C77<>NAErr,PERCENTRANK(trDbh,$C77),NAErr)","v":0.13800000000000001},{"$f":"volest($O77 - 1, $C77, $E77)","v":0.52547360581494618},{"$f":"isutilized($O77, $C77)","v":true},{"$f":"ROUND(VRF($B77),3)","v":1},{"$f":"isjuveniletree($C77)","v":false},{"$f":"SUM(IF(trUtil,(trDbh>$C77)*trBaHa*(trMGMSpp=\"Sw\"),0))","v":8.4042083935460905},{"$f":"SUM(IF(trUtil,(trDbh>$C77)*trBaHa*(trMGMSpp=\"Pl\"),0))","v":0},{"$f":"SUM(IF(trUtil,(trDbh>$C77)*trDbh*trpha*(trSppgrp=\"Dec\"),0))","v":2828.6398732138991},{"$f":"SUM(IF(trUtil,(trDbh>$C77)*trDbh*trpha*(trMGMSpp=\"Sw\"),0))","v":3712.1331075658409},{"$f":"SUM(IF(trUtil,(trDbh>$C77)*trDbh*trpha*(trMGMSpp=\"Pl\"),0))","v":0},{"$f":"SUM(IF(trUtil,(trDbh>$C77)*trDbh*trpha*(trMGMSpp=\"Sb\"),0))","v":0},{"$f":"IF(AND(($C77-$L77)>0,$L77>0),$AE77-MAX(0,volest($O77-1,$C77-$L77,$E77-$M77)),0)","v":2.6413749556091215E-3},-1,-1,-1,-1,-1,-1,-1,-1,-1,-1,-1,-1,-1,-1,-1,-1,-1,-1,-1,57]
[46,"SW",25.231341201727371,3.1437035805469957,25.824807414159164,195.74187705533643,189.07921642929716,0.44771491322758178,3.3117460729623729,1,58,4.5995901706544336E-2,3.7810941703633617E-2,0.99314890145717238,1,1,147.43332702920199,19.588673703259353,23.498860243467416,18.240544807308787,208.76140578323756,{"$f":"IF(AND(NAErr<>$L78,NAErr<>$M78),$M78/$L78,NAErr)","v":0.82205023275484224},{"$f":"IF(AND($E78<>NAErr,$C78<>NAErr),$E78/$C78,NAErr)","v":1.0235209935011764},{"$f":"IF(AND($E78<>NAErr,$C78<>NAErr),$D78*PI()*($C78/200)^2,NAErr)","v":0.15718537814965214},{"$f":"IF($C78=NAErr,NAErr,SUM(IF(trUtil,(trDbh>$C78)*trBaHa,0)))","v":17.666035360564909},{"$f":"IF($C78=NAErr,NAErr,SUM(IF(trUtil,(trDbh>$C78)*trBaHa*(trSppgrp=\"Con\"),0)))","v":8.5642666012788506},{"$f":"IF($C78=NAErr,NAErr,SUM(IF(trUtil,(trDbh>$C78)*trBaHa*(trSppgrp=\"Dec\"),0)))","v":9.1017687592860668},{"$f":"IF(ISERROR($O78),NAErr,INDEX(INDIRECT(\"SpeciesList!SppGrp\"),$O78))","v":"Con"},{"$f":"IF(ISERROR($O78),NAErr,INDEX(INDIRECT(\"SpeciesList!MGM\"),$O78))","v":"Sw"},{"$f":"IF($C78<>NAErr,PERCENTRANK(trDbh,$C78),NAErr)","v":0.123},{"$f":"volest($O78 - 1, $C78, $E78)","v":0.52791305435086078},{"$f":"isutilized($O78, $C78)","v":true},{"$f":"ROUND(VRF($B78),3)","v":1},{"$f":"isjuveniletree($C78)","v":false},{"$f":"SUM(IF(trUtil,(trDbh>$C78)*trBaHa*(trMGMSpp=\"Sw\"),0))","v":8.5642666012788506},{"$f":"SUM(IF(trUtil,(trDbh>$C78)*trBaHa*(trMGMSpp=\"Pl\"),0))","v":0},{"$f":"SUM(IF(trUtil,(trDbh>$C78)*trDbh*trpha*(trSppgrp=\"Dec\"),0))","v":2828.6398732138991},{"$f":"SUM(IF(trUtil,(trDbh>$C78)*trDbh*trpha*(trMGMSpp=\"Sw\"),0))","v":3792.2061636747285},{"$f":"SUM(IF(trUtil,(trDbh>$C78)*trDbh*trpha*(trMGMSpp=\"Pl\"),0))","v":0},{"$f":"SUM(IF(trUtil,(trDbh>$C78)*trDbh*trpha*(trMGMSpp=\"Sb\"),0))","v":0},{"$f":"IF(AND(($C78-$L78)>0,$L78>0),$AE78-MAX(0,volest($O78-1,$C78-$L78,$E78-$M78)),0)","v":2.5956725905007527E-3},-1,-1,-1,-1,-1,-1,-1,-1,-1,-1,-1,-1,-1,-1,-1,-1,-1,-1,-1,49]
[61,"SW",25.106490811656464,3.1069107026839982,25.537207257514485,194.94131709578284,188.27865646974357,0.45091592481219839,3.3000101362957075,69,95,4.6180003961213856E-2,3.8020051080533648E-2,0.99311983768876089,1,1,145.56028639775047,19.366241899134078,23.257383484303617,18.108288934685255,206.29220071587341,{"$f":"IF(AND(NAErr<>$L79,NAErr<>$M79),$M79/$L79,NAErr)","v":0.82330116542359599},{"$f":"IF(AND($E79<>NAErr,$C79<>NAErr),$E79/$C79,NAErr)","v":1.0171555813629696},{"$f":"IF(AND($E79<>NAErr,$C79<>NAErr),$D79*PI()*($C79/200)^2,NAErr)","v":0.15381216383646731},{"$f":"IF($C79=NAErr,NAErr,SUM(IF(trUtil,(trDbh>$C79)*trBaHa,0)))","v":17.823220738714561},{"$f":"IF($C79=NAErr,NAErr,SUM(IF(trUtil,(trDbh>$C79)*trBaHa*(trSppgrp=\"Con\"),0)))","v":8.7214519794285028},{"$f":"IF($C79=NAErr,NAErr,SUM(IF(trUtil,(trDbh>$C79)*trBaHa*(trSppgrp=\"Dec\"),0)))","v":9.1017687592860668},{"$f":"IF(ISERROR($O79),NAErr,INDEX(INDIRECT(\"SpeciesList!SppGrp\"),$O79))","v":"Con"},{"$f":"IF(ISERROR($O79),NAErr,INDEX(INDIRECT(\"SpeciesList!MGM\"),$O79))","v":"Sw"},{"$f":"IF($C79<>NAErr,PERCENTRANK(trDbh,$C79),NAErr)","v":0.107},{"$f":"volest($O79 - 1, $C79, $E79)","v":0.51709546395891182},{"$f":"isutilized($O79, $C79)","v":true},{"$f":"ROUND(VRF($B79),3)","v":1},{"$f":"isjuveniletree($C79)","v":false},{"$f":"SUM(IF(trUtil,(trDbh>$C79)*trBaHa*(trMGMSpp=\"Sw\"),0))","v":8.7214519794285028},{"$f":"SUM(IF(trUtil,(trDbh>$C79)*trBaHa*(trMGMSpp=\"Pl\"),0))","v":0},{"$f":"SUM(IF(trUtil,(trDbh>$C79)*trDbh*trpha*(trSppgrp=\"Dec\"),0))","v":2828.6398732138991},{"$f":"SUM(IF(trUtil,(trDbh>$C79)*trDbh*trpha*(trMGMSpp=\"Sw\"),0))","v":3871.5260213526017},{"$f":"SUM(IF(trUtil,(trDbh>$C79)*trDbh*trpha*(trMGMSpp=\"Pl\"),0))","v":0},{"$f":"SUM(IF(trUtil,(trDbh>$C79)*trDbh*trpha*(trMGMSpp=\"Sb\"),0))","v":0},{"$f":"IF(AND(($C79-$L79)>0,$L79>0),$AE79-MAX(0,volest($O79-1,$C79-$L79,$E79-$M79)),0)","v":2.5715399774911551E-3},-1,-1,-1,-1,-1,-1,-1,-1,-1,-1,-1,-1,-1,-1,-1,-1,-1,-1,-1,75]
[41,"SW",24.929956998559479,3.0464626496880034,25.216524482660283,193.96862566214509,187.30596503610582,0.45401133328674587,3.283415957864591,41,64,4.6442195635527393E-2,3.8293118108745416E-2,0.99308337900023447,1,1,142.93684459388564,19.0541813437404,22.918156259237414,17.921807802476891,202.83098999934032,{"$f":"IF(AND(NAErr<>$L80,NAErr<>$M80),$M80/$L80,NAErr)","v":0.82453289696432686},{"$f":"IF(AND($E80<>NAErr,$C80<>NAErr),$E80/$C80,NAErr)","v":1.0114949048695656},{"$f":"IF(AND($E80<>NAErr,$C80<>NAErr),$D80*PI()*($C80/200)^2,NAErr)","v":0.14870610487312019},{"$f":"IF($C80=NAErr,NAErr,SUM(IF(trUtil,(trDbh>$C80)*trBaHa,0)))","v":17.977032902551027},{"$f":"IF($C80=NAErr,NAErr,SUM(IF(trUtil,(trDbh>$C80)*trBaHa*(trSppgrp=\"Con\"),0)))","v":8.8752641432649693},{"$f":"IF($C80=NAErr,NAErr,SUM(IF(trUtil,(trDbh>$C80)*trBaHa*(trSppgrp=\"Dec\"),0)))","v":9.1017687592860668},{"$f":"IF(ISERROR($O80),NAErr,INDEX(INDIRECT(\"SpeciesList!SppGrp\"),$O80))","v":"Con"},{"$f":"IF(ISERROR($O80),NAErr,INDEX(INDIRECT(\"SpeciesList!MGM\"),$O80))","v":"Sw"},{"$f":"IF($C80<>NAErr,PERCENTRANK(trDbh,$C80),NAErr)","v":9.1999999999999998E-2},{"$f":"volest($O80 - 1, $C80, $E80)","v":0.50376378686420142},{"$f":"isutilized($O80, $C80)","v":true},{"$f":"ROUND(VRF($B80),3)","v":1},{"$f":"isjuveniletree($C80)","v":false},{"$f":"SUM(IF(trUtil,(trDbh>$C80)*trBaHa*(trMGMSpp=\"Sw\"),0))","v":8.8752641432649693},{"$f":"SUM(IF(trUtil,(trDbh>$C80)*trBaHa*(trMGMSpp=\"Pl\"),0))","v":0},{"$f":"SUM(IF(trUtil,(trDbh>$C80)*trDbh*trpha*(trSppgrp=\"Dec\"),0))","v":2828.6398732138991},{"$f":"SUM(IF(trUtil,(trDbh>$C80)*trDbh*trpha*(trMGMSpp=\"Sw\"),0))","v":3949.5296463621744},{"$f":"SUM(IF(trUtil,(trDbh>$C80)*trDbh*trpha*(trMGMSpp=\"Pl\"),0))","v":0},{"$f":"SUM(IF(trUtil,(trDbh>$C80)*trDbh*trpha*(trMGMSpp=\"Sb\"),0))","v":0},{"$f":"IF(AND(($C80-$L80)>0,$L80>0),$AE80-MAX(0,volest($O80-1,$C80-$L80,$E80-$M80)),0)","v":2.5430076070560581E-3},-1,-1,-1,-1,-1,-1,-1,-1,-1,-1,-1,-1,-1,-1,-1,-1,-1,-1,-1,67]
[45,"SW",24.850477673458229,3.0412111453534707,24.933407121753984,192.97760188794749,186,0.45796401586126789,3.2759449013050737,82,34,4.685611189820324E-2,3.8690653917867857E-2,0.99306058423957322,1,1,141.7652355435107,18.914620418308203,22.766274446598644,17.838050830497146,201.2841812389147,{"$f":"IF(AND(NAErr<>$L81,NAErr<>$M81),$M81/$L81,NAErr)","v":0.82573334300389323},{"$f":"IF(AND($E81<>NAErr,$C81<>NAErr),$E81/$C81,NAErr)","v":1.0033371369913073},{"$f":"IF(AND($E81<>NAErr,$C81<>NAErr),$D81*PI()*($C81/200)^2,NAErr)","v":0.14750472662012723},{"$f":"IF($C81=NAErr,NAErr,SUM(IF(trUtil,(trDbh>$C81)*trBaHa,0)))","v":18.125739007424148},{"$f":"IF($C81=NAErr,NAErr,SUM(IF(trUtil,(trDbh>$C81)*trBaHa*(trSppgrp=\"Con\"),0)))","v":9.0239702481380899},{"$f":"IF($C81=NAErr,NAErr,SUM(IF(trUtil,(trDbh>$C81)*trBaHa*(trSppgrp=\"Dec\"),0)))","v":9.1017687592860668},{"$f":"IF(ISERROR($O81),NAErr,INDEX(INDIRECT(\"SpeciesList!SppGrp\"),$O81))","v":"Con"},{"$f":"IF(ISERROR($O81),NAErr,INDEX(INDIRECT(\"SpeciesList!MGM\"),$O81))","v":"Sw"},{"$f":"IF($C81<>NAErr,PERCENTRANK(trDbh,$C81),NAErr)","v":7.5999999999999998E-2},{"$f":"volest($O81 - 1, $C81, $E81)","v":0.49504336020165496},{"$f":"isutilized($O81, $C81)","v":true},{"$f":"ROUND(VRF($B81),3)","v":1},{"$f":"isjuveniletree($C81)","v":false},{"$f":"SUM(IF(trUtil,(trDbh>$C81)*trBaHa*(trMGMSpp=\"Sw\"),0))","v":9.0239702481380899},{"$f":"SUM(IF(trUtil,(trDbh>$C81)*trBaHa*(trMGMSpp=\"Pl\"),0))","v":0},{"$f":"SUM(IF(trUtil,(trDbh>$C81)*trDbh*trpha*(trSppgrp=\"Dec\"),0))","v":2828.6398732138991},{"$f":"SUM(IF(trUtil,(trDbh>$C81)*trDbh*trpha*(trMGMSpp=\"Sw\"),0))","v":4025.4778292166138},{"$f":"SUM(IF(trUtil,(trDbh>$C81)*trDbh*trpha*(trMGMSpp=\"Pl\"),0))","v":0},{"$f":"SUM(IF(trUtil,(trDbh>$C81)*trDbh*trpha*(trMGMSpp=\"Sb\"),0))","v":0},{"$f":"IF(AND(($C81-$L81)>0,$L81>0),$AE81-MAX(0,volest($O81-1,$C81-$L81,$E81-$M81)),0)","v":2.5367702039482687E-3},-1,-1,-1,-1,-1,-1,-1,-1,-1,-1,-1,-1,-1,-1,-1,-1,-1,-1,-1,69]
[76,"SW",24.478851496448719,2.9499935621239648,24.832890147268248,193.35988430480219,187,0.45416385416123328,3.2410120406661798,41,60,4.6274848468550123E-2,3.8265340024906377E-2,0.99299395528095058,1,1,136.36513541524155,18.269754690205243,22.063073571966701,17.448085636848614,194.14604931426211,{"$f":"IF(AND(NAErr<>$L82,NAErr<>$M82),$M82/$L82,NAErr)","v":0.82691443173309875},{"$f":"IF(AND($E82<>NAErr,$C82<>NAErr),$E82/$C82,NAErr)","v":1.0144630417350622},{"$f":"IF(AND($E82<>NAErr,$C82<>NAErr),$D82*PI()*($C82/200)^2,NAErr)","v":0.13883310119208109},{"$f":"IF($C82=NAErr,NAErr,SUM(IF(trUtil,(trDbh>$C82)*trBaHa,0)))","v":18.273243734044275},{"$f":"IF($C82=NAErr,NAErr,SUM(IF(trUtil,(trDbh>$C82)*trBaHa*(trSppgrp=\"Con\"),0)))","v":9.1714749747582172},{"$f":"IF($C82=NAErr,NAErr,SUM(IF(trUtil,(trDbh>$C82)*trBaHa*(trSppgrp=\"Dec\"),0)))","v":9.1017687592860668},{"$f":"IF(ISERROR($O82),NAErr,INDEX(INDIRECT(\"SpeciesList!SppGrp\"),$O82))","v":"Con"},{"$f":"IF(ISERROR($O82),NAErr,INDEX(INDIRECT(\"SpeciesList!MGM\"),$O82))","v":"Sw"},{"$f":"IF($C82<>NAErr,PERCENTRANK(trDbh,$C82),NAErr)","v":6.0999999999999999E-2},{"$f":"volest($O82 - 1, $C82, $E82)","v":0.47918468531383362},{"$f":"isutilized($O82, $C82)","v":true},{"$f":"ROUND(VRF($B82),3)","v":1},{"$f":"isjuveniletree($C82)","v":false},{"$f":"SUM(IF(trUtil,(trDbh>$C82)*trBaHa*(trMGMSpp=\"Sw\"),0))","v":9.1714749747582172},{"$f":"SUM(IF(trUtil,(trDbh>$C82)*trBaHa*(trMGMSpp=\"Pl\"),0))","v":0},{"$f":"SUM(IF(trUtil,(trDbh>$C82)*trDbh*trpha*(trSppgrp=\"Dec\"),0))","v":2828.6398732138991},{"$f":"SUM(IF(trUtil,(trDbh>$C82)*trDbh*trpha*(trMGMSpp=\"Sw\"),0))","v":4101.0533788844923},{"$f":"SUM(IF(trUtil,(trDbh>$C82)*trDbh*trpha*(trMGMSpp=\"Pl\"),0))","v":0},{"$f":"SUM(IF(trUtil,(trDbh>$C82)*trDbh*trpha*(trMGMSpp=\"Sb\"),0))","v":0},{"$f":"IF(AND(($C82-$L82)>0,$L82>0),$AE82-MAX(0,volest($O82-1,$C82-$L82,$E82-$M82)),0)","v":2.4553425608702661E-3},-1,-1,-1,-1,-1,-1,-1,-1,-1,-1,-1,-1,-1,-1,-1,-1,-1,-1,-1,63]
[27,"AW",24.470927493630057,0.20831591721837378,22.394875842336571,196.04451575508494,194.08786872838414,0.29459867352765001,4.4967748672940537,90,27,2.8951397803349717E-2,2.5812261475319905E-2,0.98628707805049576,3,3,165.44939731052079,35.562165363341023,25.376585253849107,4.7939794582209094,231.18212738593184,{"$f":"IF(AND(NAErr<>$L83,NAErr<>$M83),$M83/$L83,NAErr)","v":0.89157220147530802},{"$f":"IF(AND($E83<>NAErr,$C83<>NAErr),$E83/$C83,NAErr)","v":0.91516252696862854},{"$f":"IF(AND($E83<>NAErr,$C83<>NAErr),$D83*PI()*($C83/200)^2,NAErr)","v":9.7974531871313202E-3},{"$f":"IF($C83=NAErr,NAErr,SUM(IF(trUtil,(trDbh>$C83)*trBaHa,0)))","v":18.412076835236356},{"$f":"IF($C83=NAErr,NAErr,SUM(IF(trUtil,(trDbh>$C83)*trBaHa*(trSppgrp=\"Con\"),0)))","v":9.3103080759502976},{"$f":"IF($C83=NAErr,NAErr,SUM(IF(trUtil,(trDbh>$C83)*trBaHa*(trSppgrp=\"Dec\"),0)))","v":9.1017687592860668},{"$f":"IF(ISERROR($O83),NAErr,INDEX(INDIRECT(\"SpeciesList!SppGrp\"),$O83))","v":"Dec"},{"$f":"IF(ISERROR($O83),NAErr,INDEX(INDIRECT(\"SpeciesList!MGM\"),$O83))","v":"Aw"},{"$f":"IF($C83<>NAErr,PERCENTRANK(trDbh,$C83),NAErr)","v":4.5999999999999999E-2},{"$f":"volest($O83 - 1, $C83, $E83)","v":0.44054261023288938},{"$f":"isutilized($O83, $C83)","v":true},{"$f":"ROUND(VRF($B83),3)","v":1},{"$f":"isjuveniletree($C83)","v":false},{"$f":"SUM(IF(trUtil,(trDbh>$C83)*trBaHa*(trMGMSpp=\"Sw\"),0))","v":9.3103080759502976},{"$f":"SUM(IF(trUtil,(trDbh>$C83)*trBaHa*(trMGMSpp=\"Pl\"),0))","v":0},{"$f":"SUM(IF(trUtil,(trDbh>$C83)*trDbh*trpha*(trSppgrp=\"Dec\"),0))","v":2828.6398732138991},{"$f":"SUM(IF(trUtil,(trDbh>$C83)*trDbh*trpha*(trMGMSpp=\"Sw\"),0))","v":4173.2658332072042},{"$f":"SUM(IF(trUtil,(trDbh>$C83)*trDbh*trpha*(trMGMSpp=\"Pl\"),0))","v":0},{"$f":"SUM(IF(trUtil,(trDbh>$C83)*trDbh*trpha*(trMGMSpp=\"Sb\"),0))","v":0},{"$f":"IF(AND(($C83-$L83)>0,$L83>0),$AE83-MAX(0,volest($O83-1,$C83-$L83,$E83-$M83)),0)","v":1.5123949399303283E-3},-1,-1,-1,-1,-1,-1,-1,-1,-1,-1,-1,-1,-1,-1,-1,-1,-1,-1,-1,80]
[30,"AW",24.197941657624924,6.630080604115543E-2,21.417249121914267,195.03169769197859,193.07505066527776,0.30615044302817329,4.4611785965237578,15,19,2.8714811051506462E-2,2.5932425381629615E-2,0.98618544212043679,3,3,160.91887111944467,34.619455460474242,24.66885024270103,4.707093791202773,224.91427061382274,{"$f":"IF(AND(NAErr<>$L84,NAErr<>$M84),$M84/$L84,NAErr)","v":0.9031027693378858},{"$f":"IF(AND($E84<>NAErr,$C84<>NAErr),$E84/$C84,NAErr)","v":0.88508557566364565},{"$f":"IF(AND($E84<>NAErr,$C84<>NAErr),$D84*PI()*($C84/200)^2,NAErr)","v":3.0490569787167353E-3},{"$f":"IF($C84=NAErr,NAErr,SUM(IF(trUtil,(trDbh>$C84)*trBaHa,0)))","v":18.421874288423489},{"$f":"IF($C84=NAErr,NAErr,SUM(IF(trUtil,(trDbh>$C84)*trBaHa*(trSppgrp=\"Con\"),0)))","v":9.3103080759502976},{"$f":"IF($C84=NAErr,NAErr,SUM(IF(trUtil,(trDbh>$C84)*trBaHa*(trSppgrp=\"Dec\"),0)))","v":9.111566212473198},{"$f":"IF(ISERROR($O84),NAErr,INDEX(INDIRECT(\"SpeciesList!SppGrp\"),$O84))","v":"Dec"},{"$f":"IF(ISERROR($O84),NAErr,INDEX(INDIRECT(\"SpeciesList!MGM\"),$O84))","v":"Aw"},{"$f":"IF($C84<>NAErr,PERCENTRANK(trDbh,$C84),NAErr)","v":0.03},{"$f":"volest($O84 - 1, $C84, $E84)","v":0.41209951600810474},{"$f":"isutilized($O84, $C84)","v":true},{"$f":"ROUND(VRF($B84),3)","v":1},{"$f":"isjuveniletree($C84)","v":false},{"$f":"SUM(IF(trUtil,(trDbh>$C84)*trBaHa*(trMGMSpp=\"Sw\"),0))","v":9.3103080759502976},{"$f":"SUM(IF(trUtil,(trDbh>$C84)*trBaHa*(trMGMSpp=\"Pl\"),0))","v":0},{"$f":"SUM(IF(trUtil,(trDbh>$C84)*trDbh*trpha*(trSppgrp=\"Dec\"),0))","v":2833.7375569199189},{"$f":"SUM(IF(trUtil,(trDbh>$C84)*trDbh*trpha*(trMGMSpp=\"Sw\"),0))","v":4173.2658332072042},{"$f":"SUM(IF(trUtil,(trDbh>$C84)*trDbh*trpha*(trMGMSpp=\"Pl\"),0))","v":0},{"$f":"SUM(IF(trUtil,(trDbh>$C84)*trDbh*trpha*(trMGMSpp=\"Sb\"),0))","v":0},{"$f":"IF(AND(($C84-$L84)>0,$L84>0),$AE84-MAX(0,volest($O84-1,$C84-$L84,$E84-$M84)),0)","v":1.4421597874147429E-3},-1,-1,-1,-1,-1,-1,-1,-1,-1,-1,-1,-1,-1,-1,-1,-1,-1,-1,-1,54]
[33,"AW",22.638813617904184,2.8243753831773744E-3,20.641258115939952,195.66840856230522,193.71176153560441,0.30603839048701609,4.2527327810559452,38,71,2.7196992882003088E-2,2.5794328766668657E-2,0.9856047445245254,3,3,136.46403016462551,29.515376103835894,20.85537558216113,4.2227359065421979,191.05751775716476,{"$f":"IF(AND(NAErr<>$L85,NAErr<>$M85),$M85/$L85,NAErr)","v":0.94842576451668636},{"$f":"IF(AND($E85<>NAErr,$C85<>NAErr),$E85/$C85,NAErr)","v":0.91176412617380087},{"$f":"IF(AND($E85<>NAErr,$C85<>NAErr),$D85*PI()*($C85/200)^2,NAErr)","v":1.1368930902812488E-4},{"$f":"IF($C85=NAErr,NAErr,SUM(IF(trUtil,(trDbh>$C85)*trBaHa,0)))","v":18.424923345402206},{"$f":"IF($C85=NAErr,NAErr,SUM(IF(trUtil,(trDbh>$C85)*trBaHa*(trSppgrp=\"Con\"),0)))","v":9.3103080759502976},{"$f":"IF($C85=NAErr,NAErr,SUM(IF(trUtil,(trDbh>$C85)*trBaHa*(trSppgrp=\"Dec\"),0)))","v":9.1146152694519156},{"$f":"IF(ISERROR($O85),NAErr,INDEX(INDIRECT(\"SpeciesList!SppGrp\"),$O85))","v":"Dec"},{"$f":"IF(ISERROR($O85),NAErr,INDEX(INDIRECT(\"SpeciesList!MGM\"),$O85))","v":"Aw"},{"$f":"IF($C85<>NAErr,PERCENTRANK(trDbh,$C85),NAErr)","v":1.4999999999999999E-2},{"$f":"volest($O85 - 1, $C85, $E85)","v":0.34930819807728919},{"$f":"isutilized($O85, $C85)","v":true},{"$f":"ROUND(VRF($B85),3)","v":1},{"$f":"isjuveniletree($C85)","v":false},{"$f":"SUM(IF(trUtil,(trDbh>$C85)*trBaHa*(trMGMSpp=\"Sw\"),0))","v":9.3103080759502976},{"$f":"SUM(IF(trUtil,(trDbh>$C85)*trBaHa*(trMGMSpp=\"Pl\"),0))","v":0},{"$f":"SUM(IF(trUtil,(trDbh>$C85)*trDbh*trpha*(trSppgrp=\"Dec\"),0))","v":2835.3418999563564},{"$f":"SUM(IF(trUtil,(trDbh>$C85)*trDbh*trpha*(trMGMSpp=\"Sw\"),0))","v":4173.2658332072042},{"$f":"SUM(IF(trUtil,(trDbh>$C85)*trDbh*trpha*(trMGMSpp=\"Pl\"),0))","v":0},{"$f":"SUM(IF(trUtil,(trDbh>$C85)*trDbh*trpha*(trMGMSpp=\"Sb\"),0))","v":0},{"$f":"IF(AND(($C85-$L85)>0,$L85>0),$AE85-MAX(0,volest($O85-1,$C85-$L85,$E85-$M85)),0)","v":1.2476199520679021E-3},-1,-1,-1,-1,-1,-1,-1,-1,-1,-1,-1,-1,-1,-1,-1,-1,-1,-1,-1,52]
[7,"AW",22.181600667378952,2.2527897434817333E-4,20.035014796287047,195.52460071331504,193.5679536866142,0.31165889872426694,4.1899468107878919,67,12,2.684715718241474E-2,2.5825084362848732E-2,0.98540095210879275,3,3,129.74414211654297,28.107850566272194,19.809633508316555,4.0845790258244641,181.74620521695618,{"$f":"IF(AND(NAErr<>$L86,NAErr<>$M86),$M86/$L86,NAErr)","v":0.96192994242848628},{"$f":"IF(AND($E86<>NAErr,$C86<>NAErr),$E86/$C86,NAErr)","v":0.90322673718273405},{"$f":"IF(AND($E86<>NAErr,$C86<>NAErr),$D86*PI()*($C86/200)^2,NAErr)","v":8.7055518504355661E-6},{"$f":"IF($C86=NAErr,NAErr,SUM(IF(trUtil,(trDbh>$C86)*trBaHa,0)))","v":18.425037034711234},{"$f":"IF($C86=NAErr,NAErr,SUM(IF(trUtil,(trDbh>$C86)*trBaHa*(trSppgrp=\"Con\"),0)))","v":9.3103080759502976},{"$f":"IF($C86=NAErr,NAErr,SUM(IF(trUtil,(trDbh>$C86)*trBaHa*(trSppgrp=\"Dec\"),0)))","v":9.1147289587609439},{"$f":"IF(ISERROR($O86),NAErr,INDEX(INDIRECT(\"SpeciesList!SppGrp\"),$O86))","v":"Dec"},{"$f":"IF(ISERROR($O86),NAErr,INDEX(INDIRECT(\"SpeciesList!MGM\"),$O86))","v":"Aw"},{"$f":"IF($C86<>NAErr,PERCENTRANK(trDbh,$C86),NAErr)","v":0},{"$f":"volest($O86 - 1, $C86, $E86)","v":0.32587486660473858},{"$f":"isutilized($O86, $C86)","v":true},{"$f":"ROUND(VRF($B86),3)","v":1},{"$f":"isjuveniletree($C86)","v":false},{"$f":"SUM(IF(trUtil,(trDbh>$C86)*trBaHa*(trMGMSpp=\"Sw\"),0))","v":9.3103080759502976},{"$f":"SUM(IF(trUtil,(trDbh>$C86)*trBaHa*(trMGMSpp=\"Pl\"),0))","v":0},{"$f":"SUM(IF(trUtil,(trDbh>$C86)*trDbh*trpha*(trSppgrp=\"Dec\"),0))","v":2835.4058404642433},{"$f":"SUM(IF(trUtil,(trDbh>$C86)*trDbh*trpha*(trMGMSpp=\"Sw\"),0))","v":4173.2658332072042},{"$f":"SUM(IF(trUtil,(trDbh>$C86)*trDbh*trpha*(trMGMSpp=\"Pl\"),0))","v":0},{"$f":"SUM(IF(trUtil,(trDbh>$C86)*trDbh*trpha*(trMGMSpp=\"Sb\"),0))","v":0},{"$f":"IF(AND(($C86-$L86)>0,$L86>0),$AE86-MAX(0,volest($O86-1,$C86-$L86,$E86-$M86)),0)","v":1.1829684339600965E-3},-1,-1,-1,-1,-1,-1,-1,-1,-1,-1,-1,-1,-1,-1,-1,-1,-1,-1,-1,71]

{"sheet":"Stand Table","index":14,"n_rows":21,"n_cols":32,"rows_kept":21,"cut":false,"hidden":false,"merged":[]}
[]
["trAge","(All)"]
["Hdratio","(All)"]
["trHt","(All)"]
[]
["Sum of trPha","trSpp"]
["trDbh","AW","SW","Grand Total"]
["38-40",9.452934771891611,null,9.452934771891611]
[">40",32.611731663903441,null,32.611731663903441]
["22-24",3.049654357525548E-3,null,3.049654357525548E-3]
["24-26",4.3693636410704055,31.40564506089207,35.775008701962477]
["26-28",2.3267718728326527,34.821461931764198,37.148233804596849]
["28-30",8.8766168623512449,42.797555315809163,51.674172178160404]
["30-32",6.91217450738149,38.750956340600531,45.663130847982018]
["32-34",3.9419860502494939,null,3.9419860502494939]
["34-36",4.2712537712068572,null,4.2712537712068572]
["Grand Total",72.765882795244735,147.77561864906596,220.54150144431068]
[]
[]
[]
[null,null,null,null,null,null,null,null,null,null,null,null,null,null,null,null,null,null,null,null,null,null,null,null,null,null,null,null,null,null,null,{"$f":"isutilized($O21,$C21)","v":false}]

{"sheet":"Batch Log","index":15,"n_rows":3,"n_cols":3,"rows_kept":3,"cut":false,"hidden":true,"merged":[]}
["C:\\Documents and Settings\\sjtitus\\My Documents\\MGM Developer SJT\\Active MGM Files\\MGM Crop Plans SJT.xls"]
[3,"Example CP","16:12 05 Sep 2007"]
[4,"Help Example 2","16:12 05 Sep 2007"]

{"sheet":"Trees","index":16,"n_rows":0,"n_cols":0,"rows_kept":0,"cut":false,"hidden":true,"merged":[]}

{"sheet":"SVS Images","index":17,"n_rows":0,"n_cols":0,"rows_kept":0,"cut":false,"hidden":true,"merged":[]}